{"text_format":"1","workbook":"xlsx","n_sheets":5,"sheets":["Lifetable","Population","Ageclass","RV","settings"],"not_rendered":{"charts":7,"images":10,"macros":1,"external_links":0,"defined_names":9,"comments":0,"pivot_tables":0},"unopened":[],"bounds":{"document_bytes":16777216,"sheet_cells":100000,"rows_first":2000,"rows_last":500,"rows_between":2000,"halvings":0,"cell_chars":16384,"cell_head_chars":4096},"cells_cut":0,"cells_raw":0,"read":"whole","date_system":"1900"}

{"sheet":"Lifetable","index":0,"n_rows":33,"n_cols":16,"rows_kept":33,"cut":false,"hidden":false,"merged":[]}
["X","Sx","Dx","dx","px","lx","mx","lxmx","repro","X","xlxmx","repro",null,"calc_r","r_trial","tolerance"]
[0,1000,{"$f":"B2*D2","v":250},0.25,{"$f":"1-D2","v":0.75},1,0,{"$f":"F:F*G:G","v":0},{"$f":"G2>0","v":false},{"$f":"A2","v":0},{"$f":"A2*H2","v":0},{"$f":"TRUE","v":true},null,{"$f":"EXP(-r_trial*A2)*H2","v":0},4.3661364698323064E-3,9.9999999999999995E-7]
[1,{"$f":"B2-C2","v":750},150,0.2,0.8,{"$f":"F2*E2","v":0.75},0,{"$f":"F3*G3","v":0},{"$f":"G3>0","v":false},{"$f":"A3","v":1},{"$f":"A3*H3","v":0},null,null,0]
[2,{"$f":"B3-C3","v":600},120,0.2,0.8,{"$f":"F3*E3","v":0.60000000000000009},1.2,0.72000000000000008,true,2,1.4400000000000002,null,null,0.71374013468720832]
[3,{"$f":"B4-C4","v":480},120,0.25,0.75,{"$f":"F4*E4","v":0.48000000000000009},1.4,0.67200000000000004,true,3,2.016,null,null,0.66325526496293863]
[4,{"$f":"B5-C5","v":360},180,0.5,0.5,{"$f":"F5*E5","v":0.3600000000000001},1.03,0.37080000000000013,true,4,1.4832000000000005,null,null,0.36438036754112074]
[5,180,180,1,0,0.18000000000000005,0.96,0.17280000000000004,true,5,0.86400000000000021,null,null,0.16906853648094569]
[null,0,0,null,1,0,null,0,false,0,0,null,null,0]
[null,0,0,null,1,0,null,0,false,0,0,null,null,0]
[null,0,0,null,1,0,null,0,false,0,0,null,null,0]
[null,0,0,null,1,0,null,0,false,0,0,null,null,0]
[null,0,0,null,1,0,null,0,false,0,0,null,null,0]
[null,0,0,null,1,0,null,0,false,0,0,null,null,0]
[null,0,0,null,1,0,null,0,false,0,0,null,null,0]
[null,0,0,null,1,0,null,0,false,0,0,null,null,0]
[null,0,0,null,1,0,null,0,false,0,0,null,null,0]
[null,0,0,null,1,0,null,0,false,0,0,null,null,0]
[null,0,0,null,1,0,null,0,false,0,0,null,null,0]
[null,0,0,null,1,0,null,0,{"$f":"G19>0","v":false},{"$f":"A19","v":0},{"$f":"A19*H19","v":0},null,null,{"$f":"EXP(-r_trial*A19)*H19","v":0}]
[null,0,0,null,1,0,null,0,false,0,0,null,null,0]
[null,0,0,null,1,0,null,0,false,0,0,null,null,0]
[null,0,0,null,1,0,null,0,false,0,0,null,null,0]
[null,null,null,null,null,null,null,null,null,null,null,null,null,{"$f":"SUM(N2:N22)","v":1.9104443036722134}]
["R0 = ",{"$f":"SUM(H2:H22)","v":1.9356000000000004}]
[]
["α =",{"$f":"VLOOKUP(TRUE,I2:J22, 2, FALSE)","v":2}]
["ω =",{"$f":"DMAX(I:J,\"X\",L1:L2)","v":5}]
[]
["T =",{"$f":"SUM(INDEX(K2:K22,MATCH(B26,A2:A22)):INDEX(K2:K22, MATCH(B27,A2:A22)))/B24","v":2.9981401115933042}]
[]
["rest =",{"$f":"LOG(B24, 2.71828)/B29","v":0.22027582954349942}]
[]
["r = "]

{"sheet":"Population","index":1,"n_rows":27,"n_cols":108,"rows_kept":27,"cut":false,"hidden":false,"merged":[]}
["X","y0","y1","y2","y3","y4","y5","y6","y7","y8","y9","y10","y11","y12","y13","y14","y15","y16","y17","y18","y19","y20","y21","y22","y23","y24","y25","y26","y27","y28","y29","y30","y31","y32","y33","y34","y35","y36","y37","y38","y39","y40","y41","y42","y43","y44","y45","y46","y47","y48","y49","y50","y51","y52",null,null,"y1","y2","y3","y4","y5","y6","y7","y8","y9","y10","y11","y12","y13","y14","y15","y16","y17","y18","y19","y20","y21","y22","y23","y24","y25","y26","y27","y28","y29","y30","y31","y32","y33","y34","y35","y36","y37","y38","y39","y40","y41","y42","y43","y44","y45","y46","y47","y48","y49","y50","y51","y52"]
[{"$f":"IF(Lifetable!A2 = \"\", \"\", VALUE(Lifetable!A2))","v":0},10,{"$f":"BE24","v":25.407499999999999},22.727999999999998,31.766999999999996,39.219599999999993,49.294556999999998,62.403494399999992,77.554254239999992,98.088423551999981,122.82977990519998,154.39743897983999,193.89330346319997,243.48033074753275,305.85321946659013,384.07769440683717,482.40861465815777,605.85657293409736,760.91818812665349,955.66276697271417,1200.2424523716504,1507.4260404983581,1893.2204250736274,2377.7560940543353,2986.2974327402017,3750.5839849552112,4710.4756001928763,5916.032793097238,7430.1302111414288,9331.7319523585247,11720.013054134952,14719.529650978962,18486.716019900538,23218.04282950332,{"$f":"CK24","v":29160.263581627041},36623.283852953064,45996.323584065976,57768.216310398224,72552.903266717447,91121.4523915592,114442.27194738614,143731.61604037901,180517.01611898144,226716.94652899526,284740.87899615354,357614.94415311294,449139.75377341115,564088.61463396787,708456.47147973196,889772.56225469871,1117493.0915482719,1403494.4014160836,1762692.3599833474,2213820.2708957586,null,{"$f":"Lifetable!$E2*Lifetable!$G3","v":0},{"$f":"B2*$BD2","v":0},{"$f":"C2*$BD2","v":0},0,0,0,0,0,0,0,0,0,0,0,0,0,0,0,0,0,0,0,0,0,0,0,0,0,0,0,0,0,0,0,0,0,0,0,0,0,0,0,0,0,0,0,0,0,0,0,0,0,0]
[{"$f":"IF(Lifetable!A3 = \"\", \"\", VALUE(Lifetable!A3))","v":1},9,{"$f":"B2*Lifetable!$E2","v":7.5},{"$f":"C2*Lifetable!$E2","v":19.055624999999999},{"$f":"D2*Lifetable!$E2","v":17.045999999999999},{"$f":"E2*Lifetable!$E2","v":23.825249999999997},{"$f":"F2*Lifetable!$E2","v":29.414699999999996},{"$f":"G2*Lifetable!$E2","v":36.970917749999998},{"$f":"H2*Lifetable!$E2","v":46.802620799999993},{"$f":"I2*Lifetable!$E2","v":58.165690679999997},{"$f":"J2*Lifetable!$E2","v":73.566317663999982},{"$f":"K2*Lifetable!$E2","v":92.122334928899988},{"$f":"L2*Lifetable!$E2","v":115.79807923487999},{"$f":"M2*Lifetable!$E2","v":145.41997759739996},{"$f":"N2*Lifetable!$E2","v":182.61024806064955},{"$f":"O2*Lifetable!$E2","v":229.38991459994259},{"$f":"P2*Lifetable!$E2","v":288.0582708051279},{"$f":"Q2*Lifetable!$E2","v":361.80646099361832},{"$f":"R2*Lifetable!$E2","v":454.39242970057302},{"$f":"S2*Lifetable!$E2","v":570.68864109499009},{"$f":"T2*Lifetable!$E2","v":716.74707522953565},{"$f":"U2*Lifetable!$E2","v":900.18183927873781},{"$f":"V2*Lifetable!$E2","v":1130.5695303737687},{"$f":"W2*Lifetable!$E2","v":1419.9153188052205},{"$f":"X2*Lifetable!$E2","v":1783.3170705407515},{"$f":"Y2*Lifetable!$E2","v":2239.7230745551515},{"$f":"Z2*Lifetable!$E2","v":2812.9379887164087},{"$f":"AA2*Lifetable!$E2","v":3532.8567001446572},{"$f":"AB2*Lifetable!$E2","v":4437.0245948229285},{"$f":"AC2*Lifetable!$E2","v":5572.5976583560714},{"$f":"AD2*Lifetable!$E2","v":6998.7989642688935},{"$f":"AE2*Lifetable!$E2","v":8790.0097906012143},{"$f":"AF2*Lifetable!$E2","v":11039.647238234222},{"$f":"AG2*Lifetable!$E2","v":13865.037014925403},{"$f":"AH2*Lifetable!$E2","v":17413.53212212749},{"$f":"AI2*Lifetable!$E2","v":21870.197686220279},{"$f":"AJ2*Lifetable!$E2","v":27467.4628897148},{"$f":"AK2*Lifetable!$E2","v":34497.242688049482},{"$f":"AL2*Lifetable!$E2","v":43326.16223279867},{"$f":"AM2*Lifetable!$E2","v":54414.677450038085},{"$f":"AN2*Lifetable!$E2","v":68341.0892936694},{"$f":"AO2*Lifetable!$E2","v":85831.703960539598},{"$f":"AP2*Lifetable!$E2","v":107798.71203028425},{"$f":"AQ2*Lifetable!$E2","v":135387.76208923609},{"$f":"AR2*Lifetable!$E2","v":170037.70989674644},{"$f":"AS2*Lifetable!$E2","v":213555.65924711514},{"$f":"AT2*Lifetable!$E2","v":268211.20811483474},{"$f":"AU2*Lifetable!$E2","v":336854.81533005834},{"$f":"AV2*Lifetable!$E2","v":423066.4609754759},{"$f":"AW2*Lifetable!$E2","v":531342.35360979894},{"$f":"AX2*Lifetable!$E2","v":667329.42169102398},{"$f":"AY2*Lifetable!$E2","v":838119.81866120396},{"$f":"AZ2*Lifetable!$E2","v":1052620.8010620626},{"$f":"BA2*Lifetable!$E2","v":1322019.2699875105},null,{"$f":"Lifetable!$E3*Lifetable!$G4","v":0.96},{"$f":"B3*$BD3","v":8.64},7.1999999999999993,18.293399999999998,16.364159999999998,22.872239999999998,28.238111999999994,35.492081039999995,44.930515967999995,55.839063052799993,70.623664957439985,88.437441531743985,111.16615606548478,139.60317849350395,175.30583813822358,220.21431801594488,276.53593997292279,347.33420255387358,436.2167325125501,547.86109545119052,688.07719222035416,864.17456570758827,1085.3467491588178,1363.1187060530117,1711.9843877191213,2150.1341515729455,2700.4204691677523,3391.5424321388709,4259.5436110300116,5349.693752021828,6718.8470056981378,8438.4093989771645,10598.061348704852,13310.435534328386,16716.990837242389,20995.389778771467,26368.764374126207,33117.352980527503,41593.11574348672,52238.090352036561,65607.445721922617,82398.435802118009,103486.76354907287,129972.25160566664,163236.20150087657,205013.43287723052,257482.75979024134,323380.62271685601,406143.80253645685,510088.65946540696,640636.24482338305,804595.02591475577,1010515.9690195801]
[{"$f":"IF(Lifetable!A4 = \"\", \"\", VALUE(Lifetable!A4))","v":2},8,{"$f":"B3*Lifetable!$E3","v":7.2},{"$f":"C3*Lifetable!$E3","v":6},{"$f":"D3*Lifetable!$E3","v":15.2445},{"$f":"E3*Lifetable!$E3","v":13.636800000000001},{"$f":"F3*Lifetable!$E3","v":19.060199999999998},{"$f":"G3*Lifetable!$E3","v":23.531759999999998},{"$f":"H3*Lifetable!$E3","v":29.576734200000001},{"$f":"I3*Lifetable!$E3","v":37.442096639999995},{"$f":"J3*Lifetable!$E3","v":46.532552543999998},{"$f":"K3*Lifetable!$E3","v":58.85305413119999},{"$f":"L3*Lifetable!$E3","v":73.697867943119988},{"$f":"M3*Lifetable!$E3","v":92.638463387903997},{"$f":"N3*Lifetable!$E3","v":116.33598207791998},{"$f":"O3*Lifetable!$E3","v":146.08819844851965},{"$f":"P3*Lifetable!$E3","v":183.51193167995407},{"$f":"Q3*Lifetable!$E3","v":230.44661664410233},{"$f":"R3*Lifetable!$E3","v":289.44516879489464},{"$f":"S3*Lifetable!$E3","v":363.51394376045846},{"$f":"T3*Lifetable!$E3","v":456.55091287599208},{"$f":"U3*Lifetable!$E3","v":573.39766018362855},{"$f":"V3*Lifetable!$E3","v":720.14547142299034},{"$f":"W3*Lifetable!$E3","v":904.45562429901497},{"$f":"X3*Lifetable!$E3","v":1135.9322550441764},{"$f":"Y3*Lifetable!$E3","v":1426.6536564326013},{"$f":"Z3*Lifetable!$E3","v":1791.7784596441213},{"$f":"AA3*Lifetable!$E3","v":2250.3503909731271},{"$f":"AB3*Lifetable!$E3","v":2826.2853601157258},{"$f":"AC3*Lifetable!$E3","v":3549.6196758583428},{"$f":"AD3*Lifetable!$E3","v":4458.0781266848571},{"$f":"AE3*Lifetable!$E3","v":5599.0391714151156},{"$f":"AF3*Lifetable!$E3","v":7032.007832480972},{"$f":"AG3*Lifetable!$E3","v":8831.7177905873777},{"$f":"AH3*Lifetable!$E3","v":11092.029611940323},{"$f":"AI3*Lifetable!$E3","v":13930.825697701992},{"$f":"AJ3*Lifetable!$E3","v":17496.158148976225},{"$f":"AK3*Lifetable!$E3","v":21973.970311771842},{"$f":"AL3*Lifetable!$E3","v":27597.794150439586},{"$f":"AM3*Lifetable!$E3","v":34660.929786238936},{"$f":"AN3*Lifetable!$E3","v":43531.741960030471},{"$f":"AO3*Lifetable!$E3","v":54672.871434935521},{"$f":"AP3*Lifetable!$E3","v":68665.363168431679},{"$f":"AQ3*Lifetable!$E3","v":86238.969624227408},{"$f":"AR3*Lifetable!$E3","v":108310.20967138887},{"$f":"AS3*Lifetable!$E3","v":136030.16791739716},{"$f":"AT3*Lifetable!$E3","v":170844.52739769212},{"$f":"AU3*Lifetable!$E3","v":214568.96649186779},{"$f":"AV3*Lifetable!$E3","v":269483.85226404667},{"$f":"AW3*Lifetable!$E3","v":338453.16878038074},{"$f":"AX3*Lifetable!$E3","v":425073.88288783917},{"$f":"AY3*Lifetable!$E3","v":533863.53735281923},{"$f":"AZ3*Lifetable!$E3","v":670495.85492896324},{"$f":"BA3*Lifetable!$E3","v":842096.64084965014},null,{"$f":"Lifetable!$E4*Lifetable!$G5","v":1.1199999999999999},8.9599999999999991,8.0640000000000001,6.7199999999999989,17.073839999999997,15.273216,21.347423999999997,26.355571199999996,33.125942303999999,41.935148236799989,52.116458849279994,65.915420626943984,82.541612096294372,103.75507899445246,130.29629992727035,163.61878226234199,205.53336348154855,258.1002106413946,324.17858905028197,407.13561701171341,511.3370224211111,642.20537940566385,806.5629279937491,1012.9902992148967,1272.2441256494774,1597.8520952045133,2006.7918748014156,2520.3924378899019,3165.4396033296125,3975.5740369613436,4993.0475018870393,6270.9238719849291,7875.8487723786875,9891.5239254578628,12423.07316537316,15602.524781426229,19595.697126853371,24610.84674918446,30909.529448492332,38820.241360587606,48755.550995234124,61233.616007127777,76905.206748643468,96587.645979134686,121307.43483195553,152353.7880674848,191345.87068541514,240317.24247089188,301821.91453573224,379067.54903402639,476082.74883437983,597927.16183515743,750955.35752043873]
[{"$f":"IF(Lifetable!A5 = \"\", \"\", VALUE(Lifetable!A5))","v":3},7,{"$f":"B4*Lifetable!$E4","v":6.4},{"$f":"C4*Lifetable!$E4","v":5.7600000000000007},{"$f":"D4*Lifetable!$E4","v":4.8000000000000007},{"$f":"E4*Lifetable!$E4","v":12.195600000000001},{"$f":"F4*Lifetable!$E4","v":10.909440000000002},{"$f":"G4*Lifetable!$E4","v":15.248159999999999},{"$f":"H4*Lifetable!$E4","v":18.825407999999999},{"$f":"I4*Lifetable!$E4","v":23.661387360000003},{"$f":"J4*Lifetable!$E4","v":29.953677311999996},{"$f":"K4*Lifetable!$E4","v":37.226042035200003},{"$f":"L4*Lifetable!$E4","v":47.082443304959995},{"$f":"M4*Lifetable!$E4","v":58.95829435449599},{"$f":"N4*Lifetable!$E4","v":74.110770710323195},{"$f":"O4*Lifetable!$E4","v":93.068785662335983},{"$f":"P4*Lifetable!$E4","v":116.87055875881572},{"$f":"Q4*Lifetable!$E4","v":146.80954534396326},{"$f":"R4*Lifetable!$E4","v":184.35729331528188},{"$f":"S4*Lifetable!$E4","v":231.55613503591573},{"$f":"T4*Lifetable!$E4","v":290.81115500836677},{"$f":"U4*Lifetable!$E4","v":365.2407303007937},{"$f":"V4*Lifetable!$E4","v":458.71812814690287},{"$f":"W4*Lifetable!$E4","v":576.11637713839229},{"$f":"X4*Lifetable!$E4","v":723.564499439212},{"$f":"Y4*Lifetable!$E4","v":908.74580403534117},{"$f":"Z4*Lifetable!$E4","v":1141.3229251460812},{"$f":"AA4*Lifetable!$E4","v":1433.4227677152971},{"$f":"AB4*Lifetable!$E4","v":1800.2803127785019},{"$f":"AC4*Lifetable!$E4","v":2261.0282880925806},{"$f":"AD4*Lifetable!$E4","v":2839.6957406866745},{"$f":"AE4*Lifetable!$E4","v":3566.4625013478858},{"$f":"AF4*Lifetable!$E4","v":4479.2313371320924},{"$f":"AG4*Lifetable!$E4","v":5625.6062659847776},{"$f":"AH4*Lifetable!$E4","v":7065.3742324699024},{"$f":"AI4*Lifetable!$E4","v":8873.6236895522579},{"$f":"AJ4*Lifetable!$E4","v":11144.660558161595},{"$f":"AK4*Lifetable!$E4","v":13996.926519180981},{"$f":"AL4*Lifetable!$E4","v":17579.176249417473},{"$f":"AM4*Lifetable!$E4","v":22078.235320351669},{"$f":"AN4*Lifetable!$E4","v":27728.743828991152},{"$f":"AO4*Lifetable!$E4","v":34825.393568024381},{"$f":"AP4*Lifetable!$E4","v":43738.297147948419},{"$f":"AQ4*Lifetable!$E4","v":54932.290534745349},{"$f":"AR4*Lifetable!$E4","v":68991.175699381929},{"$f":"AS4*Lifetable!$E4","v":86648.1677371111},{"$f":"AT4*Lifetable!$E4","v":108824.13433391774},{"$f":"AU4*Lifetable!$E4","v":136675.62191815369},{"$f":"AV4*Lifetable!$E4","v":171655.17319349424},{"$f":"AW4*Lifetable!$E4","v":215587.08181123735},{"$f":"AX4*Lifetable!$E4","v":270762.53502430458},{"$f":"AY4*Lifetable!$E4","v":340059.10631027137},{"$f":"AZ4*Lifetable!$E4","v":427090.82988225541},{"$f":"BA4*Lifetable!$E4","v":536396.68394317059},null,{"$f":"Lifetable!$E5*Lifetable!$G6","v":0.77249999999999996},5.4074999999999998,4.944,4.4496000000000002,3.7080000000000002,9.4211010000000002,8.4275424000000019,11.779203599999999,14.542627679999999,18.278421735600002,23.139215723519996,28.757117472192,36.371187453081596,45.54528238884815,57.250570373724663,71.895636924154545,90.282506641185137,113.41037377821162,142.41600908605525,178.87711431524488,224.65161724396333,282.14846415736309,354.35975399348246,445.04990133940805,558.95357581679127,702.00613361730097,881.67195967534769,1107.3190880600671,1390.7165416213927,1746.6443525515185,2193.6649596804559,2755.0922822912416,3460.2062079345415,4345.7808404732405,5458.0015945829991,6854.874300179119,8609.2502811798313,10812.625736067308,13579.913652674997,17055.436784971662,21420.454607895663,26902.616531298834,33787.834546790153,42435.194438090781,53295.683227772541,66935.709576918322,84066.643772951444,105581.91793177371,132603.6212919743,166541.02069918084,209164.05830627528,262695.6596246846,329927.66608404228]
[{"$f":"IF(Lifetable!A6 = \"\", \"\", VALUE(Lifetable!A6))","v":4},5,{"$f":"B5*Lifetable!$E5","v":5.25},{"$f":"C5*Lifetable!$E5","v":4.8000000000000007},{"$f":"D5*Lifetable!$E5","v":4.32},{"$f":"E5*Lifetable!$E5","v":3.6000000000000005},{"$f":"F5*Lifetable!$E5","v":9.1467000000000009},{"$f":"G5*Lifetable!$E5","v":8.1820800000000009},{"$f":"H5*Lifetable!$E5","v":11.436119999999999},{"$f":"I5*Lifetable!$E5","v":14.119056},{"$f":"J5*Lifetable!$E5","v":17.746040520000001},{"$f":"K5*Lifetable!$E5","v":22.465257983999997},{"$f":"L5*Lifetable!$E5","v":27.9195315264},{"$f":"M5*Lifetable!$E5","v":35.311832478719992},{"$f":"N5*Lifetable!$E5","v":44.218720765871993},{"$f":"O5*Lifetable!$E5","v":55.583078032742392},{"$f":"P5*Lifetable!$E5","v":69.801589246751988},{"$f":"Q5*Lifetable!$E5","v":87.652919069111789},{"$f":"R5*Lifetable!$E5","v":110.10715900797246},{"$f":"S5*Lifetable!$E5","v":138.26796998646142},{"$f":"T5*Lifetable!$E5","v":173.66710127693679},{"$f":"U5*Lifetable!$E5","v":218.10836625627508},{"$f":"V5*Lifetable!$E5","v":273.93054772559526},{"$f":"W5*Lifetable!$E5","v":344.03859611017714},{"$f":"X5*Lifetable!$E5","v":432.08728285379425},{"$f":"Y5*Lifetable!$E5","v":542.67337457940903},{"$f":"Z5*Lifetable!$E5","v":681.55935302650585},{"$f":"AA5*Lifetable!$E5","v":855.99219385956087},{"$f":"AB5*Lifetable!$E5","v":1075.0670757864727},{"$f":"AC5*Lifetable!$E5","v":1350.2102345838764},{"$f":"AD5*Lifetable!$E5","v":1695.7712160694355},{"$f":"AE5*Lifetable!$E5","v":2129.7718055150058},{"$f":"AF5*Lifetable!$E5","v":2674.8468760109145},{"$f":"AG5*Lifetable!$E5","v":3359.4235028490693},{"$f":"AH5*Lifetable!$E5","v":4219.2046994885832},{"$f":"AI5*Lifetable!$E5","v":5299.030674352427},{"$f":"AJ5*Lifetable!$E5","v":6655.217767164193},{"$f":"AK5*Lifetable!$E5","v":8358.4954186211962},{"$f":"AL5*Lifetable!$E5","v":10497.694889385735},{"$f":"AM5*Lifetable!$E5","v":13184.382187063104},{"$f":"AN5*Lifetable!$E5","v":16558.676490263751},{"$f":"AO5*Lifetable!$E5","v":20796.557871743364},{"$f":"AP5*Lifetable!$E5","v":26119.045176018284},{"$f":"AQ5*Lifetable!$E5","v":32803.722860961316},{"$f":"AR5*Lifetable!$E5","v":41199.217901059012},{"$f":"AS5*Lifetable!$E5","v":51743.38177453645},{"$f":"AT5*Lifetable!$E5","v":64986.125802833325},{"$f":"AU5*Lifetable!$E5","v":81618.100750438301},{"$f":"AV5*Lifetable!$E5","v":102506.71643861526},{"$f":"AW5*Lifetable!$E5","v":128741.37989512068},{"$f":"AX5*Lifetable!$E5","v":161690.31135842801},{"$f":"AY5*Lifetable!$E5","v":203071.90126822842},{"$f":"AZ5*Lifetable!$E5","v":255044.32973270351},{"$f":"BA5*Lifetable!$E5","v":320318.12241169158},null,{"$f":"Lifetable!$E6*Lifetable!$G7","v":0.48},2.4,2.52,2.3040000000000003,2.0735999999999999,1.7280000000000002,4.3904160000000001,3.9273984000000004,5.4893375999999989,6.7771468800000001,8.5180994496000011,10.783323832319999,13.401375132671999,16.949679589785596,21.224985967618554,26.679877455716348,33.504762838440953,42.073401153173656,52.851436323826775,66.368625593501477,83.360208612929654,104.69201580301203,131.48666290828572,165.13852613288503,207.40189576982124,260.48321979811635,327.1484894527228,410.87625305258922,516.03219637750692,648.1009126002607,813.97018371332899,1022.2904666472027,1283.9265004852389,1612.5232813675532,2025.2182557545198,2543.5347236891648,3194.5045282388123,4012.0778009381738,5038.893546905153,6328.5034497902898,7948.1647153266003,9982.3477784368133,12537.141684488775,15745.786973261431,19775.624592508324,24836.823251777496,31193.340385359996,39176.688360210384,49203.223890535322,61795.862349657924,77611.349452045441,97474.512608749646,122421.27827169768]
[{"$f":"IF(Lifetable!A7 = \"\", \"\", VALUE(Lifetable!A7))","v":5},3,{"$f":"B6*Lifetable!$E6","v":2.5},{"$f":"C6*Lifetable!$E6","v":2.625},{"$f":"D6*Lifetable!$E6","v":2.4000000000000004},{"$f":"E6*Lifetable!$E6","v":2.16},{"$f":"F6*Lifetable!$E6","v":1.8000000000000003},{"$f":"G6*Lifetable!$E6","v":4.5733500000000005},{"$f":"H6*Lifetable!$E6","v":4.0910400000000005},{"$f":"I6*Lifetable!$E6","v":5.7180599999999995},{"$f":"J6*Lifetable!$E6","v":7.0595280000000002},{"$f":"K6*Lifetable!$E6","v":8.8730202600000005},{"$f":"L6*Lifetable!$E6","v":11.232628991999999},{"$f":"M6*Lifetable!$E6","v":13.9597657632},{"$f":"N6*Lifetable!$E6","v":17.655916239359996},{"$f":"O6*Lifetable!$E6","v":22.109360382935996},{"$f":"P6*Lifetable!$E6","v":27.791539016371196},{"$f":"Q6*Lifetable!$E6","v":34.900794623375994},{"$f":"R6*Lifetable!$E6","v":43.826459534555894},{"$f":"S6*Lifetable!$E6","v":55.053579503986228},{"$f":"T6*Lifetable!$E6","v":69.133984993230712},{"$f":"U6*Lifetable!$E6","v":86.833550638468395},{"$f":"V6*Lifetable!$E6","v":109.05418312813754},{"$f":"W6*Lifetable!$E6","v":136.96527386279763},{"$f":"X6*Lifetable!$E6","v":172.01929805508857},{"$f":"Y6*Lifetable!$E6","v":216.04364142689712},{"$f":"Z6*Lifetable!$E6","v":271.33668728970451},{"$f":"AA6*Lifetable!$E6","v":340.77967651325292},{"$f":"AB6*Lifetable!$E6","v":427.99609692978044},{"$f":"AC6*Lifetable!$E6","v":537.53353789323637},{"$f":"AD6*Lifetable!$E6","v":675.1051172919382},{"$f":"AE6*Lifetable!$E6","v":847.88560803471773},{"$f":"AF6*Lifetable!$E6","v":1064.8859027575029},{"$f":"AG6*Lifetable!$E6","v":1337.4234380054572},{"$f":"AH6*Lifetable!$E6","v":1679.7117514245347},{"$f":"AI6*Lifetable!$E6","v":2109.6023497442916},{"$f":"AJ6*Lifetable!$E6","v":2649.5153371762135},{"$f":"AK6*Lifetable!$E6","v":3327.6088835820965},{"$f":"AL6*Lifetable!$E6","v":4179.2477093105981},{"$f":"AM6*Lifetable!$E6","v":5248.8474446928676},{"$f":"AN6*Lifetable!$E6","v":6592.1910935315518},{"$f":"AO6*Lifetable!$E6","v":8279.3382451318757},{"$f":"AP6*Lifetable!$E6","v":10398.278935871682},{"$f":"AQ6*Lifetable!$E6","v":13059.522588009142},{"$f":"AR6*Lifetable!$E6","v":16401.861430480658},{"$f":"AS6*Lifetable!$E6","v":20599.608950529506},{"$f":"AT6*Lifetable!$E6","v":25871.690887268225},{"$f":"AU6*Lifetable!$E6","v":32493.062901416662},{"$f":"AV6*Lifetable!$E6","v":40809.050375219151},{"$f":"AW6*Lifetable!$E6","v":51253.358219307629},{"$f":"AX6*Lifetable!$E6","v":64370.689947560342},{"$f":"AY6*Lifetable!$E6","v":80845.155679214004},{"$f":"AZ6*Lifetable!$E6","v":101535.95063411421},{"$f":"BA6*Lifetable!$E6","v":127522.16486635176},null,{"$f":"Lifetable!$E7*Lifetable!$G8","v":0},0,{"$f":"C7*$BD7","v":0},{"$f":"D7*$BD7","v":0},{"$f":"E7*$BD7","v":0},{"$f":"F7*$BD7","v":0},{"$f":"G7*$BD7","v":0},{"$f":"H7*$BD7","v":0},{"$f":"I7*$BD7","v":0},{"$f":"J7*$BD7","v":0},{"$f":"K7*$BD7","v":0},{"$f":"L7*$BD7","v":0},{"$f":"M7*$BD7","v":0},{"$f":"N7*$BD7","v":0},{"$f":"O7*$BD7","v":0},{"$f":"P7*$BD7","v":0},{"$f":"Q7*$BD7","v":0},{"$f":"R7*$BD7","v":0},{"$f":"S7*$BD7","v":0},{"$f":"T7*$BD7","v":0},{"$f":"U7*$BD7","v":0},{"$f":"V7*$BD7","v":0},{"$f":"W7*$BD7","v":0},{"$f":"X7*$BD7","v":0},{"$f":"Y7*$BD7","v":0},{"$f":"Z7*$BD7","v":0},{"$f":"AA7*$BD7","v":0},{"$f":"AB7*$BD7","v":0},{"$f":"AC7*$BD7","v":0},{"$f":"AD7*$BD7","v":0},{"$f":"AE7*$BD7","v":0},{"$f":"AF7*$BD7","v":0},{"$f":"AG7*$BD7","v":0},{"$f":"AH7*$BD7","v":0},{"$f":"AI7*$BD7","v":0},{"$f":"AJ7*$BD7","v":0},{"$f":"AK7*$BD7","v":0},{"$f":"AL7*$BD7","v":0},{"$f":"AM7*$BD7","v":0},{"$f":"AN7*$BD7","v":0},{"$f":"AO7*$BD7","v":0},{"$f":"AP7*$BD7","v":0},{"$f":"AQ7*$BD7","v":0},{"$f":"AR7*$BD7","v":0},{"$f":"AS7*$BD7","v":0},{"$f":"AT7*$BD7","v":0},{"$f":"AU7*$BD7","v":0},{"$f":"AV7*$BD7","v":0},{"$f":"AW7*$BD7","v":0},{"$f":"AX7*$BD7","v":0},{"$f":"AY7*$BD7","v":0},{"$f":"AZ7*$BD7","v":0},{"$f":"BA7*$BD7","v":0}]
[{"$f":"IF(Lifetable!A8 = \"\", \"\", VALUE(Lifetable!A8))","v":""},null,{"$f":"B7*Lifetable!$E7","v":0},{"$f":"C7*Lifetable!$E7","v":0},{"$f":"D7*Lifetable!$E7","v":0},{"$f":"E7*Lifetable!$E7","v":0},{"$f":"F7*Lifetable!$E7","v":0},{"$f":"G7*Lifetable!$E7","v":0},{"$f":"H7*Lifetable!$E7","v":0},{"$f":"I7*Lifetable!$E7","v":0},{"$f":"J7*Lifetable!$E7","v":0},{"$f":"K7*Lifetable!$E7","v":0},{"$f":"L7*Lifetable!$E7","v":0},{"$f":"M7*Lifetable!$E7","v":0},{"$f":"N7*Lifetable!$E7","v":0},{"$f":"O7*Lifetable!$E7","v":0},{"$f":"P7*Lifetable!$E7","v":0},{"$f":"Q7*Lifetable!$E7","v":0},{"$f":"R7*Lifetable!$E7","v":0},{"$f":"S7*Lifetable!$E7","v":0},{"$f":"T7*Lifetable!$E7","v":0},{"$f":"U7*Lifetable!$E7","v":0},{"$f":"V7*Lifetable!$E7","v":0},{"$f":"W7*Lifetable!$E7","v":0},{"$f":"X7*Lifetable!$E7","v":0},{"$f":"Y7*Lifetable!$E7","v":0},{"$f":"Z7*Lifetable!$E7","v":0},{"$f":"AA7*Lifetable!$E7","v":0},{"$f":"AB7*Lifetable!$E7","v":0},{"$f":"AC7*Lifetable!$E7","v":0},{"$f":"AD7*Lifetable!$E7","v":0},{"$f":"AE7*Lifetable!$E7","v":0},{"$f":"AF7*Lifetable!$E7","v":0},{"$f":"AG7*Lifetable!$E7","v":0},{"$f":"AH7*Lifetable!$E7","v":0},{"$f":"AI7*Lifetable!$E7","v":0},{"$f":"AJ7*Lifetable!$E7","v":0},{"$f":"AK7*Lifetable!$E7","v":0},{"$f":"AL7*Lifetable!$E7","v":0},{"$f":"AM7*Lifetable!$E7","v":0},{"$f":"AN7*Lifetable!$E7","v":0},{"$f":"AO7*Lifetable!$E7","v":0},{"$f":"AP7*Lifetable!$E7","v":0},{"$f":"AQ7*Lifetable!$E7","v":0},{"$f":"AR7*Lifetable!$E7","v":0},{"$f":"AS7*Lifetable!$E7","v":0},{"$f":"AT7*Lifetable!$E7","v":0},{"$f":"AU7*Lifetable!$E7","v":0},{"$f":"AV7*Lifetable!$E7","v":0},{"$f":"AW7*Lifetable!$E7","v":0},{"$f":"AX7*Lifetable!$E7","v":0},{"$f":"AY7*Lifetable!$E7","v":0},{"$f":"AZ7*Lifetable!$E7","v":0},{"$f":"BA7*Lifetable!$E7","v":0},null,{"$f":"Lifetable!$E8*Lifetable!$G9","v":0},0,0,0,0,0,0,0,0,0,0,0,0,0,0,0,0,0,0,0,0,0,0,0,0,0,0,0,0,0,0,0,0,0,0,0,0,0,0,0,0,0,0,0,0,0,0,0,0,0,0,0,0]
[{"$f":"IF(Lifetable!A9 = \"\", \"\", VALUE(Lifetable!A9))","v":""},null,{"$f":"B8*Lifetable!$E8","v":0},{"$f":"C8*Lifetable!$E8","v":0},{"$f":"D8*Lifetable!$E8","v":0},{"$f":"E8*Lifetable!$E8","v":0},{"$f":"F8*Lifetable!$E8","v":0},{"$f":"G8*Lifetable!$E8","v":0},{"$f":"H8*Lifetable!$E8","v":0},{"$f":"I8*Lifetable!$E8","v":0},{"$f":"J8*Lifetable!$E8","v":0},{"$f":"K8*Lifetable!$E8","v":0},{"$f":"L8*Lifetable!$E8","v":0},{"$f":"M8*Lifetable!$E8","v":0},{"$f":"N8*Lifetable!$E8","v":0},{"$f":"O8*Lifetable!$E8","v":0},{"$f":"P8*Lifetable!$E8","v":0},{"$f":"Q8*Lifetable!$E8","v":0},{"$f":"R8*Lifetable!$E8","v":0},{"$f":"S8*Lifetable!$E8","v":0},{"$f":"T8*Lifetable!$E8","v":0},{"$f":"U8*Lifetable!$E8","v":0},{"$f":"V8*Lifetable!$E8","v":0},{"$f":"W8*Lifetable!$E8","v":0},{"$f":"X8*Lifetable!$E8","v":0},{"$f":"Y8*Lifetable!$E8","v":0},{"$f":"Z8*Lifetable!$E8","v":0},{"$f":"AA8*Lifetable!$E8","v":0},{"$f":"AB8*Lifetable!$E8","v":0},{"$f":"AC8*Lifetable!$E8","v":0},{"$f":"AD8*Lifetable!$E8","v":0},{"$f":"AE8*Lifetable!$E8","v":0},{"$f":"AF8*Lifetable!$E8","v":0},{"$f":"AG8*Lifetable!$E8","v":0},{"$f":"AH8*Lifetable!$E8","v":0},{"$f":"AI8*Lifetable!$E8","v":0},{"$f":"AJ8*Lifetable!$E8","v":0},{"$f":"AK8*Lifetable!$E8","v":0},{"$f":"AL8*Lifetable!$E8","v":0},{"$f":"AM8*Lifetable!$E8","v":0},{"$f":"AN8*Lifetable!$E8","v":0},{"$f":"AO8*Lifetable!$E8","v":0},{"$f":"AP8*Lifetable!$E8","v":0},{"$f":"AQ8*Lifetable!$E8","v":0},{"$f":"AR8*Lifetable!$E8","v":0},{"$f":"AS8*Lifetable!$E8","v":0},{"$f":"AT8*Lifetable!$E8","v":0},{"$f":"AU8*Lifetable!$E8","v":0},{"$f":"AV8*Lifetable!$E8","v":0},{"$f":"AW8*Lifetable!$E8","v":0},{"$f":"AX8*Lifetable!$E8","v":0},{"$f":"AY8*Lifetable!$E8","v":0},{"$f":"AZ8*Lifetable!$E8","v":0},{"$f":"BA8*Lifetable!$E8","v":0},null,{"$f":"Lifetable!$E9*Lifetable!$G10","v":0},0,0,0,0,0,0,0,0,0,0,0,0,0,0,0,0,0,0,0,0,0,0,0,0,0,0,0,0,0,0,0,0,0,0,0,0,0,0,0,0,0,0,0,0,0,0,0,0,0,0,0,0]
[{"$f":"IF(Lifetable!A10 = \"\", \"\", VALUE(Lifetable!A10))","v":""},null,{"$f":"B9*Lifetable!$E9","v":0},{"$f":"C9*Lifetable!$E9","v":0},{"$f":"D9*Lifetable!$E9","v":0},{"$f":"E9*Lifetable!$E9","v":0},{"$f":"F9*Lifetable!$E9","v":0},{"$f":"G9*Lifetable!$E9","v":0},{"$f":"H9*Lifetable!$E9","v":0},{"$f":"I9*Lifetable!$E9","v":0},{"$f":"J9*Lifetable!$E9","v":0},{"$f":"K9*Lifetable!$E9","v":0},{"$f":"L9*Lifetable!$E9","v":0},{"$f":"M9*Lifetable!$E9","v":0},{"$f":"N9*Lifetable!$E9","v":0},{"$f":"O9*Lifetable!$E9","v":0},{"$f":"P9*Lifetable!$E9","v":0},{"$f":"Q9*Lifetable!$E9","v":0},{"$f":"R9*Lifetable!$E9","v":0},{"$f":"S9*Lifetable!$E9","v":0},{"$f":"T9*Lifetable!$E9","v":0},{"$f":"U9*Lifetable!$E9","v":0},{"$f":"V9*Lifetable!$E9","v":0},{"$f":"W9*Lifetable!$E9","v":0},{"$f":"X9*Lifetable!$E9","v":0},{"$f":"Y9*Lifetable!$E9","v":0},{"$f":"Z9*Lifetable!$E9","v":0},{"$f":"AA9*Lifetable!$E9","v":0},{"$f":"AB9*Lifetable!$E9","v":0},{"$f":"AC9*Lifetable!$E9","v":0},{"$f":"AD9*Lifetable!$E9","v":0},{"$f":"AE9*Lifetable!$E9","v":0},{"$f":"AF9*Lifetable!$E9","v":0},{"$f":"AG9*Lifetable!$E9","v":0},{"$f":"AH9*Lifetable!$E9","v":0},{"$f":"AI9*Lifetable!$E9","v":0},{"$f":"AJ9*Lifetable!$E9","v":0},{"$f":"AK9*Lifetable!$E9","v":0},{"$f":"AL9*Lifetable!$E9","v":0},{"$f":"AM9*Lifetable!$E9","v":0},{"$f":"AN9*Lifetable!$E9","v":0},{"$f":"AO9*Lifetable!$E9","v":0},{"$f":"AP9*Lifetable!$E9","v":0},{"$f":"AQ9*Lifetable!$E9","v":0},{"$f":"AR9*Lifetable!$E9","v":0},{"$f":"AS9*Lifetable!$E9","v":0},{"$f":"AT9*Lifetable!$E9","v":0},{"$f":"AU9*Lifetable!$E9","v":0},{"$f":"AV9*Lifetable!$E9","v":0},{"$f":"AW9*Lifetable!$E9","v":0},{"$f":"AX9*Lifetable!$E9","v":0},{"$f":"AY9*Lifetable!$E9","v":0},{"$f":"AZ9*Lifetable!$E9","v":0},{"$f":"BA9*Lifetable!$E9","v":0},null,{"$f":"Lifetable!$E10*Lifetable!$G11","v":0},0,0,0,0,0,0,0,0,0,0,0,0,0,0,0,0,0,0,0,0,0,0,0,0,0,0,0,0,0,0,0,0,0,0,0,0,0,0,0,0,0,0,0,0,0,0,0,0,0,0,0,0]
[{"$f":"IF(Lifetable!A11 = \"\", \"\", VALUE(Lifetable!A11))","v":""},null,{"$f":"B10*Lifetable!$E10","v":0},{"$f":"C10*Lifetable!$E10","v":0},{"$f":"D10*Lifetable!$E10","v":0},{"$f":"E10*Lifetable!$E10","v":0},{"$f":"F10*Lifetable!$E10","v":0},{"$f":"G10*Lifetable!$E10","v":0},{"$f":"H10*Lifetable!$E10","v":0},{"$f":"I10*Lifetable!$E10","v":0},{"$f":"J10*Lifetable!$E10","v":0},{"$f":"K10*Lifetable!$E10","v":0},{"$f":"L10*Lifetable!$E10","v":0},{"$f":"M10*Lifetable!$E10","v":0},{"$f":"N10*Lifetable!$E10","v":0},{"$f":"O10*Lifetable!$E10","v":0},{"$f":"P10*Lifetable!$E10","v":0},{"$f":"Q10*Lifetable!$E10","v":0},{"$f":"R10*Lifetable!$E10","v":0},{"$f":"S10*Lifetable!$E10","v":0},{"$f":"T10*Lifetable!$E10","v":0},{"$f":"U10*Lifetable!$E10","v":0},{"$f":"V10*Lifetable!$E10","v":0},{"$f":"W10*Lifetable!$E10","v":0},{"$f":"X10*Lifetable!$E10","v":0},{"$f":"Y10*Lifetable!$E10","v":0},{"$f":"Z10*Lifetable!$E10","v":0},{"$f":"AA10*Lifetable!$E10","v":0},{"$f":"AB10*Lifetable!$E10","v":0},{"$f":"AC10*Lifetable!$E10","v":0},{"$f":"AD10*Lifetable!$E10","v":0},{"$f":"AE10*Lifetable!$E10","v":0},{"$f":"AF10*Lifetable!$E10","v":0},{"$f":"AG10*Lifetable!$E10","v":0},{"$f":"AH10*Lifetable!$E10","v":0},{"$f":"AI10*Lifetable!$E10","v":0},{"$f":"AJ10*Lifetable!$E10","v":0},{"$f":"AK10*Lifetable!$E10","v":0},{"$f":"AL10*Lifetable!$E10","v":0},{"$f":"AM10*Lifetable!$E10","v":0},{"$f":"AN10*Lifetable!$E10","v":0},{"$f":"AO10*Lifetable!$E10","v":0},{"$f":"AP10*Lifetable!$E10","v":0},{"$f":"AQ10*Lifetable!$E10","v":0},{"$f":"AR10*Lifetable!$E10","v":0},{"$f":"AS10*Lifetable!$E10","v":0},{"$f":"AT10*Lifetable!$E10","v":0},{"$f":"AU10*Lifetable!$E10","v":0},{"$f":"AV10*Lifetable!$E10","v":0},{"$f":"AW10*Lifetable!$E10","v":0},{"$f":"AX10*Lifetable!$E10","v":0},{"$f":"AY10*Lifetable!$E10","v":0},{"$f":"AZ10*Lifetable!$E10","v":0},{"$f":"BA10*Lifetable!$E10","v":0},null,{"$f":"Lifetable!$E11*Lifetable!$G12","v":0},0,0,0,0,0,0,0,0,0,0,0,0,0,0,0,0,0,0,0,0,0,0,0,0,0,0,0,0,0,0,0,0,0,0,0,0,0,0,0,0,0,0,0,0,0,0,0,0,0,0,0,0]
[{"$f":"IF(Lifetable!A12 = \"\", \"\", VALUE(Lifetable!A12))","v":""},null,{"$f":"B11*Lifetable!$E11","v":0},{"$f":"C11*Lifetable!$E11","v":0},{"$f":"D11*Lifetable!$E11","v":0},{"$f":"E11*Lifetable!$E11","v":0},{"$f":"F11*Lifetable!$E11","v":0},{"$f":"G11*Lifetable!$E11","v":0},{"$f":"H11*Lifetable!$E11","v":0},{"$f":"I11*Lifetable!$E11","v":0},{"$f":"J11*Lifetable!$E11","v":0},{"$f":"K11*Lifetable!$E11","v":0},{"$f":"L11*Lifetable!$E11","v":0},{"$f":"M11*Lifetable!$E11","v":0},{"$f":"N11*Lifetable!$E11","v":0},{"$f":"O11*Lifetable!$E11","v":0},{"$f":"P11*Lifetable!$E11","v":0},{"$f":"Q11*Lifetable!$E11","v":0},{"$f":"R11*Lifetable!$E11","v":0},{"$f":"S11*Lifetable!$E11","v":0},{"$f":"T11*Lifetable!$E11","v":0},{"$f":"U11*Lifetable!$E11","v":0},{"$f":"V11*Lifetable!$E11","v":0},{"$f":"W11*Lifetable!$E11","v":0},{"$f":"X11*Lifetable!$E11","v":0},{"$f":"Y11*Lifetable!$E11","v":0},{"$f":"Z11*Lifetable!$E11","v":0},{"$f":"AA11*Lifetable!$E11","v":0},{"$f":"AB11*Lifetable!$E11","v":0},{"$f":"AC11*Lifetable!$E11","v":0},{"$f":"AD11*Lifetable!$E11","v":0},{"$f":"AE11*Lifetable!$E11","v":0},{"$f":"AF11*Lifetable!$E11","v":0},{"$f":"AG11*Lifetable!$E11","v":0},{"$f":"AH11*Lifetable!$E11","v":0},{"$f":"AI11*Lifetable!$E11","v":0},{"$f":"AJ11*Lifetable!$E11","v":0},{"$f":"AK11*Lifetable!$E11","v":0},{"$f":"AL11*Lifetable!$E11","v":0},{"$f":"AM11*Lifetable!$E11","v":0},{"$f":"AN11*Lifetable!$E11","v":0},{"$f":"AO11*Lifetable!$E11","v":0},{"$f":"AP11*Lifetable!$E11","v":0},{"$f":"AQ11*Lifetable!$E11","v":0},{"$f":"AR11*Lifetable!$E11","v":0},{"$f":"AS11*Lifetable!$E11","v":0},{"$f":"AT11*Lifetable!$E11","v":0},{"$f":"AU11*Lifetable!$E11","v":0},{"$f":"AV11*Lifetable!$E11","v":0},{"$f":"AW11*Lifetable!$E11","v":0},{"$f":"AX11*Lifetable!$E11","v":0},{"$f":"AY11*Lifetable!$E11","v":0},{"$f":"AZ11*Lifetable!$E11","v":0},{"$f":"BA11*Lifetable!$E11","v":0},null,{"$f":"Lifetable!$E12*Lifetable!$G13","v":0},0,0,0,0,0,0,0,0,0,0,0,0,0,0,0,0,0,0,0,0,0,0,0,0,0,0,0,0,0,0,0,0,0,0,0,0,0,0,0,0,0,0,0,0,0,0,0,0,0,0,0,0]
[{"$f":"IF(Lifetable!A13 = \"\", \"\", VALUE(Lifetable!A13))","v":""},null,{"$f":"B12*Lifetable!$E12","v":0},{"$f":"C12*Lifetable!$E12","v":0},{"$f":"D12*Lifetable!$E12","v":0},{"$f":"E12*Lifetable!$E12","v":0},{"$f":"F12*Lifetable!$E12","v":0},{"$f":"G12*Lifetable!$E12","v":0},{"$f":"H12*Lifetable!$E12","v":0},{"$f":"I12*Lifetable!$E12","v":0},{"$f":"J12*Lifetable!$E12","v":0},{"$f":"K12*Lifetable!$E12","v":0},{"$f":"L12*Lifetable!$E12","v":0},{"$f":"M12*Lifetable!$E12","v":0},{"$f":"N12*Lifetable!$E12","v":0},{"$f":"O12*Lifetable!$E12","v":0},{"$f":"P12*Lifetable!$E12","v":0},{"$f":"Q12*Lifetable!$E12","v":0},{"$f":"R12*Lifetable!$E12","v":0},{"$f":"S12*Lifetable!$E12","v":0},{"$f":"T12*Lifetable!$E12","v":0},{"$f":"U12*Lifetable!$E12","v":0},{"$f":"V12*Lifetable!$E12","v":0},{"$f":"W12*Lifetable!$E12","v":0},{"$f":"X12*Lifetable!$E12","v":0},{"$f":"Y12*Lifetable!$E12","v":0},{"$f":"Z12*Lifetable!$E12","v":0},{"$f":"AA12*Lifetable!$E12","v":0},{"$f":"AB12*Lifetable!$E12","v":0},{"$f":"AC12*Lifetable!$E12","v":0},{"$f":"AD12*Lifetable!$E12","v":0},{"$f":"AE12*Lifetable!$E12","v":0},{"$f":"AF12*Lifetable!$E12","v":0},{"$f":"AG12*Lifetable!$E12","v":0},{"$f":"AH12*Lifetable!$E12","v":0},{"$f":"AI12*Lifetable!$E12","v":0},{"$f":"AJ12*Lifetable!$E12","v":0},{"$f":"AK12*Lifetable!$E12","v":0},{"$f":"AL12*Lifetable!$E12","v":0},{"$f":"AM12*Lifetable!$E12","v":0},{"$f":"AN12*Lifetable!$E12","v":0},{"$f":"AO12*Lifetable!$E12","v":0},{"$f":"AP12*Lifetable!$E12","v":0},{"$f":"AQ12*Lifetable!$E12","v":0},{"$f":"AR12*Lifetable!$E12","v":0},{"$f":"AS12*Lifetable!$E12","v":0},{"$f":"AT12*Lifetable!$E12","v":0},{"$f":"AU12*Lifetable!$E12","v":0},{"$f":"AV12*Lifetable!$E12","v":0},{"$f":"AW12*Lifetable!$E12","v":0},{"$f":"AX12*Lifetable!$E12","v":0},{"$f":"AY12*Lifetable!$E12","v":0},{"$f":"AZ12*Lifetable!$E12","v":0},{"$f":"BA12*Lifetable!$E12","v":0},null,{"$f":"Lifetable!$E13*Lifetable!$G14","v":0},0,0,0,0,0,0,0,0,0,0,0,0,0,0,0,0,0,0,0,0,0,0,0,0,0,0,0,0,0,0,0,0,0,0,0,0,0,0,0,0,0,0,0,0,0,0,0,0,0,0,0,0]
[{"$f":"IF(Lifetable!A14 = \"\", \"\", VALUE(Lifetable!A14))","v":""},null,{"$f":"B13*Lifetable!$E13","v":0},{"$f":"C13*Lifetable!$E13","v":0},{"$f":"D13*Lifetable!$E13","v":0},{"$f":"E13*Lifetable!$E13","v":0},{"$f":"F13*Lifetable!$E13","v":0},{"$f":"G13*Lifetable!$E13","v":0},{"$f":"H13*Lifetable!$E13","v":0},{"$f":"I13*Lifetable!$E13","v":0},{"$f":"J13*Lifetable!$E13","v":0},{"$f":"K13*Lifetable!$E13","v":0},{"$f":"L13*Lifetable!$E13","v":0},{"$f":"M13*Lifetable!$E13","v":0},{"$f":"N13*Lifetable!$E13","v":0},{"$f":"O13*Lifetable!$E13","v":0},{"$f":"P13*Lifetable!$E13","v":0},{"$f":"Q13*Lifetable!$E13","v":0},{"$f":"R13*Lifetable!$E13","v":0},{"$f":"S13*Lifetable!$E13","v":0},{"$f":"T13*Lifetable!$E13","v":0},{"$f":"U13*Lifetable!$E13","v":0},{"$f":"V13*Lifetable!$E13","v":0},{"$f":"W13*Lifetable!$E13","v":0},{"$f":"X13*Lifetable!$E13","v":0},{"$f":"Y13*Lifetable!$E13","v":0},{"$f":"Z13*Lifetable!$E13","v":0},{"$f":"AA13*Lifetable!$E13","v":0},{"$f":"AB13*Lifetable!$E13","v":0},{"$f":"AC13*Lifetable!$E13","v":0},{"$f":"AD13*Lifetable!$E13","v":0},{"$f":"AE13*Lifetable!$E13","v":0},{"$f":"AF13*Lifetable!$E13","v":0},{"$f":"AG13*Lifetable!$E13","v":0},{"$f":"AH13*Lifetable!$E13","v":0},{"$f":"AI13*Lifetable!$E13","v":0},{"$f":"AJ13*Lifetable!$E13","v":0},{"$f":"AK13*Lifetable!$E13","v":0},{"$f":"AL13*Lifetable!$E13","v":0},{"$f":"AM13*Lifetable!$E13","v":0},{"$f":"AN13*Lifetable!$E13","v":0},{"$f":"AO13*Lifetable!$E13","v":0},{"$f":"AP13*Lifetable!$E13","v":0},{"$f":"AQ13*Lifetable!$E13","v":0},{"$f":"AR13*Lifetable!$E13","v":0},{"$f":"AS13*Lifetable!$E13","v":0},{"$f":"AT13*Lifetable!$E13","v":0},{"$f":"AU13*Lifetable!$E13","v":0},{"$f":"AV13*Lifetable!$E13","v":0},{"$f":"AW13*Lifetable!$E13","v":0},{"$f":"AX13*Lifetable!$E13","v":0},{"$f":"AY13*Lifetable!$E13","v":0},{"$f":"AZ13*Lifetable!$E13","v":0},{"$f":"BA13*Lifetable!$E13","v":0},null,{"$f":"Lifetable!$E14*Lifetable!$G15","v":0},{"$f":"B14*$BD14","v":0},{"$f":"C14*$BD14","v":0},{"$f":"D14*$BD14","v":0},{"$f":"E14*$BD14","v":0},{"$f":"F14*$BD14","v":0},{"$f":"G14*$BD14","v":0},{"$f":"H14*$BD14","v":0},{"$f":"I14*$BD14","v":0},{"$f":"J14*$BD14","v":0},{"$f":"K14*$BD14","v":0},{"$f":"L14*$BD14","v":0},{"$f":"M14*$BD14","v":0},{"$f":"N14*$BD14","v":0},{"$f":"O14*$BD14","v":0},{"$f":"P14*$BD14","v":0},{"$f":"Q14*$BD14","v":0},{"$f":"R14*$BD14","v":0},{"$f":"S14*$BD14","v":0},{"$f":"T14*$BD14","v":0},{"$f":"U14*$BD14","v":0},{"$f":"V14*$BD14","v":0},{"$f":"W14*$BD14","v":0},{"$f":"X14*$BD14","v":0},{"$f":"Y14*$BD14","v":0},{"$f":"Z14*$BD14","v":0},{"$f":"AA14*$BD14","v":0},{"$f":"AB14*$BD14","v":0},{"$f":"AC14*$BD14","v":0},{"$f":"AD14*$BD14","v":0},{"$f":"AE14*$BD14","v":0},{"$f":"AF14*$BD14","v":0},{"$f":"AG14*$BD14","v":0},{"$f":"AH14*$BD14","v":0},{"$f":"AI14*$BD14","v":0},{"$f":"AJ14*$BD14","v":0},{"$f":"AK14*$BD14","v":0},{"$f":"AL14*$BD14","v":0},{"$f":"AM14*$BD14","v":0},{"$f":"AN14*$BD14","v":0},{"$f":"AO14*$BD14","v":0},{"$f":"AP14*$BD14","v":0},{"$f":"AQ14*$BD14","v":0},{"$f":"AR14*$BD14","v":0},{"$f":"AS14*$BD14","v":0},{"$f":"AT14*$BD14","v":0},{"$f":"AU14*$BD14","v":0},{"$f":"AV14*$BD14","v":0},{"$f":"AW14*$BD14","v":0},{"$f":"AX14*$BD14","v":0},{"$f":"AY14*$BD14","v":0},{"$f":"AZ14*$BD14","v":0},{"$f":"BA14*$BD14","v":0}]
[{"$f":"IF(Lifetable!A15 = \"\", \"\", VALUE(Lifetable!A15))","v":""},null,{"$f":"B14*Lifetable!$E14","v":0},{"$f":"C14*Lifetable!$E14","v":0},{"$f":"D14*Lifetable!$E14","v":0},{"$f":"E14*Lifetable!$E14","v":0},{"$f":"F14*Lifetable!$E14","v":0},{"$f":"G14*Lifetable!$E14","v":0},{"$f":"H14*Lifetable!$E14","v":0},{"$f":"I14*Lifetable!$E14","v":0},{"$f":"J14*Lifetable!$E14","v":0},{"$f":"K14*Lifetable!$E14","v":0},{"$f":"L14*Lifetable!$E14","v":0},{"$f":"M14*Lifetable!$E14","v":0},{"$f":"N14*Lifetable!$E14","v":0},{"$f":"O14*Lifetable!$E14","v":0},{"$f":"P14*Lifetable!$E14","v":0},{"$f":"Q14*Lifetable!$E14","v":0},{"$f":"R14*Lifetable!$E14","v":0},{"$f":"S14*Lifetable!$E14","v":0},{"$f":"T14*Lifetable!$E14","v":0},{"$f":"U14*Lifetable!$E14","v":0},{"$f":"V14*Lifetable!$E14","v":0},{"$f":"W14*Lifetable!$E14","v":0},{"$f":"X14*Lifetable!$E14","v":0},{"$f":"Y14*Lifetable!$E14","v":0},{"$f":"Z14*Lifetable!$E14","v":0},{"$f":"AA14*Lifetable!$E14","v":0},{"$f":"AB14*Lifetable!$E14","v":0},{"$f":"AC14*Lifetable!$E14","v":0},{"$f":"AD14*Lifetable!$E14","v":0},{"$f":"AE14*Lifetable!$E14","v":0},{"$f":"AF14*Lifetable!$E14","v":0},{"$f":"AG14*Lifetable!$E14","v":0},{"$f":"AH14*Lifetable!$E14","v":0},{"$f":"AI14*Lifetable!$E14","v":0},{"$f":"AJ14*Lifetable!$E14","v":0},{"$f":"AK14*Lifetable!$E14","v":0},{"$f":"AL14*Lifetable!$E14","v":0},{"$f":"AM14*Lifetable!$E14","v":0},{"$f":"AN14*Lifetable!$E14","v":0},{"$f":"AO14*Lifetable!$E14","v":0},{"$f":"AP14*Lifetable!$E14","v":0},{"$f":"AQ14*Lifetable!$E14","v":0},{"$f":"AR14*Lifetable!$E14","v":0},{"$f":"AS14*Lifetable!$E14","v":0},{"$f":"AT14*Lifetable!$E14","v":0},{"$f":"AU14*Lifetable!$E14","v":0},{"$f":"AV14*Lifetable!$E14","v":0},{"$f":"AW14*Lifetable!$E14","v":0},{"$f":"AX14*Lifetable!$E14","v":0},{"$f":"AY14*Lifetable!$E14","v":0},{"$f":"AZ14*Lifetable!$E14","v":0},{"$f":"BA14*Lifetable!$E14","v":0},null,{"$f":"Lifetable!$E15*Lifetable!$G16","v":0},0,0,0,0,0,0,0,0,0,0,0,0,0,0,0,0,0,0,0,0,0,0,0,0,0,0,0,0,0,0,0,0,0,0,0,0,0,0,0,0,0,0,0,0,0,0,0,0,0,0,0,0]
[{"$f":"IF(Lifetable!A16 = \"\", \"\", VALUE(Lifetable!A16))","v":""},null,{"$f":"B15*Lifetable!$E15","v":0},{"$f":"C15*Lifetable!$E15","v":0},{"$f":"D15*Lifetable!$E15","v":0},{"$f":"E15*Lifetable!$E15","v":0},{"$f":"F15*Lifetable!$E15","v":0},{"$f":"G15*Lifetable!$E15","v":0},{"$f":"H15*Lifetable!$E15","v":0},{"$f":"I15*Lifetable!$E15","v":0},{"$f":"J15*Lifetable!$E15","v":0},{"$f":"K15*Lifetable!$E15","v":0},{"$f":"L15*Lifetable!$E15","v":0},{"$f":"M15*Lifetable!$E15","v":0},{"$f":"N15*Lifetable!$E15","v":0},{"$f":"O15*Lifetable!$E15","v":0},{"$f":"P15*Lifetable!$E15","v":0},{"$f":"Q15*Lifetable!$E15","v":0},{"$f":"R15*Lifetable!$E15","v":0},{"$f":"S15*Lifetable!$E15","v":0},{"$f":"T15*Lifetable!$E15","v":0},{"$f":"U15*Lifetable!$E15","v":0},{"$f":"V15*Lifetable!$E15","v":0},{"$f":"W15*Lifetable!$E15","v":0},{"$f":"X15*Lifetable!$E15","v":0},{"$f":"Y15*Lifetable!$E15","v":0},{"$f":"Z15*Lifetable!$E15","v":0},{"$f":"AA15*Lifetable!$E15","v":0},{"$f":"AB15*Lifetable!$E15","v":0},{"$f":"AC15*Lifetable!$E15","v":0},{"$f":"AD15*Lifetable!$E15","v":0},{"$f":"AE15*Lifetable!$E15","v":0},{"$f":"AF15*Lifetable!$E15","v":0},{"$f":"AG15*Lifetable!$E15","v":0},{"$f":"AH15*Lifetable!$E15","v":0},{"$f":"AI15*Lifetable!$E15","v":0},{"$f":"AJ15*Lifetable!$E15","v":0},{"$f":"AK15*Lifetable!$E15","v":0},{"$f":"AL15*Lifetable!$E15","v":0},{"$f":"AM15*Lifetable!$E15","v":0},{"$f":"AN15*Lifetable!$E15","v":0},{"$f":"AO15*Lifetable!$E15","v":0},{"$f":"AP15*Lifetable!$E15","v":0},{"$f":"AQ15*Lifetable!$E15","v":0},{"$f":"AR15*Lifetable!$E15","v":0},{"$f":"AS15*Lifetable!$E15","v":0},{"$f":"AT15*Lifetable!$E15","v":0},{"$f":"AU15*Lifetable!$E15","v":0},{"$f":"AV15*Lifetable!$E15","v":0},{"$f":"AW15*Lifetable!$E15","v":0},{"$f":"AX15*Lifetable!$E15","v":0},{"$f":"AY15*Lifetable!$E15","v":0},{"$f":"AZ15*Lifetable!$E15","v":0},{"$f":"BA15*Lifetable!$E15","v":0},null,{"$f":"Lifetable!$E16*Lifetable!$G17","v":0},0,0,0,0,0,0,0,0,0,0,0,0,0,0,0,0,0,0,0,0,0,0,0,0,0,0,0,0,0,0,0,0,0,0,0,0,0,0,0,0,0,0,0,0,0,0,0,0,0,0,0,0]
[{"$f":"IF(Lifetable!A17 = \"\", \"\", VALUE(Lifetable!A17))","v":""},null,{"$f":"B16*Lifetable!$E16","v":0},{"$f":"C16*Lifetable!$E16","v":0},{"$f":"D16*Lifetable!$E16","v":0},{"$f":"E16*Lifetable!$E16","v":0},{"$f":"F16*Lifetable!$E16","v":0},{"$f":"G16*Lifetable!$E16","v":0},{"$f":"H16*Lifetable!$E16","v":0},{"$f":"I16*Lifetable!$E16","v":0},{"$f":"J16*Lifetable!$E16","v":0},{"$f":"K16*Lifetable!$E16","v":0},{"$f":"L16*Lifetable!$E16","v":0},{"$f":"M16*Lifetable!$E16","v":0},{"$f":"N16*Lifetable!$E16","v":0},{"$f":"O16*Lifetable!$E16","v":0},{"$f":"P16*Lifetable!$E16","v":0},{"$f":"Q16*Lifetable!$E16","v":0},{"$f":"R16*Lifetable!$E16","v":0},{"$f":"S16*Lifetable!$E16","v":0},{"$f":"T16*Lifetable!$E16","v":0},{"$f":"U16*Lifetable!$E16","v":0},{"$f":"V16*Lifetable!$E16","v":0},{"$f":"W16*Lifetable!$E16","v":0},{"$f":"X16*Lifetable!$E16","v":0},{"$f":"Y16*Lifetable!$E16","v":0},{"$f":"Z16*Lifetable!$E16","v":0},{"$f":"AA16*Lifetable!$E16","v":0},{"$f":"AB16*Lifetable!$E16","v":0},{"$f":"AC16*Lifetable!$E16","v":0},{"$f":"AD16*Lifetable!$E16","v":0},{"$f":"AE16*Lifetable!$E16","v":0},{"$f":"AF16*Lifetable!$E16","v":0},{"$f":"AG16*Lifetable!$E16","v":0},{"$f":"AH16*Lifetable!$E16","v":0},{"$f":"AI16*Lifetable!$E16","v":0},{"$f":"AJ16*Lifetable!$E16","v":0},{"$f":"AK16*Lifetable!$E16","v":0},{"$f":"AL16*Lifetable!$E16","v":0},{"$f":"AM16*Lifetable!$E16","v":0},{"$f":"AN16*Lifetable!$E16","v":0},{"$f":"AO16*Lifetable!$E16","v":0},{"$f":"AP16*Lifetable!$E16","v":0},{"$f":"AQ16*Lifetable!$E16","v":0},{"$f":"AR16*Lifetable!$E16","v":0},{"$f":"AS16*Lifetable!$E16","v":0},{"$f":"AT16*Lifetable!$E16","v":0},{"$f":"AU16*Lifetable!$E16","v":0},{"$f":"AV16*Lifetable!$E16","v":0},{"$f":"AW16*Lifetable!$E16","v":0},{"$f":"AX16*Lifetable!$E16","v":0},{"$f":"AY16*Lifetable!$E16","v":0},{"$f":"AZ16*Lifetable!$E16","v":0},{"$f":"BA16*Lifetable!$E16","v":0},null,{"$f":"Lifetable!$E17*Lifetable!$G18","v":0},0,0,0,0,0,0,0,0,0,0,0,0,0,0,0,0,0,0,0,0,0,0,0,0,0,0,0,0,0,0,0,0,0,0,0,0,0,0,0,0,0,0,0,0,0,0,0,0,0,0,0,0]
[{"$f":"IF(Lifetable!A18 = \"\", \"\", VALUE(Lifetable!A18))","v":""},null,{"$f":"B17*Lifetable!$E17","v":0},{"$f":"C17*Lifetable!$E17","v":0},{"$f":"D17*Lifetable!$E17","v":0},{"$f":"E17*Lifetable!$E17","v":0},{"$f":"F17*Lifetable!$E17","v":0},{"$f":"G17*Lifetable!$E17","v":0},{"$f":"H17*Lifetable!$E17","v":0},{"$f":"I17*Lifetable!$E17","v":0},{"$f":"J17*Lifetable!$E17","v":0},{"$f":"K17*Lifetable!$E17","v":0},{"$f":"L17*Lifetable!$E17","v":0},{"$f":"M17*Lifetable!$E17","v":0},{"$f":"N17*Lifetable!$E17","v":0},{"$f":"O17*Lifetable!$E17","v":0},{"$f":"P17*Lifetable!$E17","v":0},{"$f":"Q17*Lifetable!$E17","v":0},{"$f":"R17*Lifetable!$E17","v":0},{"$f":"S17*Lifetable!$E17","v":0},{"$f":"T17*Lifetable!$E17","v":0},{"$f":"U17*Lifetable!$E17","v":0},{"$f":"V17*Lifetable!$E17","v":0},{"$f":"W17*Lifetable!$E17","v":0},{"$f":"X17*Lifetable!$E17","v":0},{"$f":"Y17*Lifetable!$E17","v":0},{"$f":"Z17*Lifetable!$E17","v":0},{"$f":"AA17*Lifetable!$E17","v":0},{"$f":"AB17*Lifetable!$E17","v":0},{"$f":"AC17*Lifetable!$E17","v":0},{"$f":"AD17*Lifetable!$E17","v":0},{"$f":"AE17*Lifetable!$E17","v":0},{"$f":"AF17*Lifetable!$E17","v":0},{"$f":"AG17*Lifetable!$E17","v":0},{"$f":"AH17*Lifetable!$E17","v":0},{"$f":"AI17*Lifetable!$E17","v":0},{"$f":"AJ17*Lifetable!$E17","v":0},{"$f":"AK17*Lifetable!$E17","v":0},{"$f":"AL17*Lifetable!$E17","v":0},{"$f":"AM17*Lifetable!$E17","v":0},{"$f":"AN17*Lifetable!$E17","v":0},{"$f":"AO17*Lifetable!$E17","v":0},{"$f":"AP17*Lifetable!$E17","v":0},{"$f":"AQ17*Lifetable!$E17","v":0},{"$f":"AR17*Lifetable!$E17","v":0},{"$f":"AS17*Lifetable!$E17","v":0},{"$f":"AT17*Lifetable!$E17","v":0},{"$f":"AU17*Lifetable!$E17","v":0},{"$f":"AV17*Lifetable!$E17","v":0},{"$f":"AW17*Lifetable!$E17","v":0},{"$f":"AX17*Lifetable!$E17","v":0},{"$f":"AY17*Lifetable!$E17","v":0},{"$f":"AZ17*Lifetable!$E17","v":0},{"$f":"BA17*Lifetable!$E17","v":0},null,{"$f":"Lifetable!$E18*Lifetable!$G19","v":0},0,0,0,0,0,0,0,0,0,0,0,0,0,0,0,0,0,0,0,0,0,0,0,0,0,0,0,0,0,0,0,0,0,0,0,0,0,0,0,0,0,0,0,0,0,0,0,0,0,0,0,0]
[{"$f":"IF(Lifetable!A19 = \"\", \"\", VALUE(Lifetable!A19))","v":""},null,{"$f":"B18*Lifetable!$E18","v":0},{"$f":"C18*Lifetable!$E18","v":0},{"$f":"D18*Lifetable!$E18","v":0},{"$f":"E18*Lifetable!$E18","v":0},{"$f":"F18*Lifetable!$E18","v":0},{"$f":"G18*Lifetable!$E18","v":0},{"$f":"H18*Lifetable!$E18","v":0},{"$f":"I18*Lifetable!$E18","v":0},{"$f":"J18*Lifetable!$E18","v":0},{"$f":"K18*Lifetable!$E18","v":0},{"$f":"L18*Lifetable!$E18","v":0},{"$f":"M18*Lifetable!$E18","v":0},{"$f":"N18*Lifetable!$E18","v":0},{"$f":"O18*Lifetable!$E18","v":0},{"$f":"P18*Lifetable!$E18","v":0},{"$f":"Q18*Lifetable!$E18","v":0},{"$f":"R18*Lifetable!$E18","v":0},{"$f":"S18*Lifetable!$E18","v":0},{"$f":"T18*Lifetable!$E18","v":0},{"$f":"U18*Lifetable!$E18","v":0},{"$f":"V18*Lifetable!$E18","v":0},{"$f":"W18*Lifetable!$E18","v":0},{"$f":"X18*Lifetable!$E18","v":0},{"$f":"Y18*Lifetable!$E18","v":0},{"$f":"Z18*Lifetable!$E18","v":0},{"$f":"AA18*Lifetable!$E18","v":0},{"$f":"AB18*Lifetable!$E18","v":0},{"$f":"AC18*Lifetable!$E18","v":0},{"$f":"AD18*Lifetable!$E18","v":0},{"$f":"AE18*Lifetable!$E18","v":0},{"$f":"AF18*Lifetable!$E18","v":0},{"$f":"AG18*Lifetable!$E18","v":0},{"$f":"AH18*Lifetable!$E18","v":0},{"$f":"AI18*Lifetable!$E18","v":0},{"$f":"AJ18*Lifetable!$E18","v":0},{"$f":"AK18*Lifetable!$E18","v":0},{"$f":"AL18*Lifetable!$E18","v":0},{"$f":"AM18*Lifetable!$E18","v":0},{"$f":"AN18*Lifetable!$E18","v":0},{"$f":"AO18*Lifetable!$E18","v":0},{"$f":"AP18*Lifetable!$E18","v":0},{"$f":"AQ18*Lifetable!$E18","v":0},{"$f":"AR18*Lifetable!$E18","v":0},{"$f":"AS18*Lifetable!$E18","v":0},{"$f":"AT18*Lifetable!$E18","v":0},{"$f":"AU18*Lifetable!$E18","v":0},{"$f":"AV18*Lifetable!$E18","v":0},{"$f":"AW18*Lifetable!$E18","v":0},{"$f":"AX18*Lifetable!$E18","v":0},{"$f":"AY18*Lifetable!$E18","v":0},{"$f":"AZ18*Lifetable!$E18","v":0},{"$f":"BA18*Lifetable!$E18","v":0},null,{"$f":"Lifetable!$E19*Lifetable!$G20","v":0},0,0,0,0,0,0,0,0,0,0,0,0,0,0,0,0,0,0,0,0,0,0,0,0,0,0,0,0,0,0,0,0,0,0,0,0,0,0,0,0,0,0,0,0,0,0,0,0,0,0,0,0]
[{"$f":"IF(Lifetable!A20 = \"\", \"\", VALUE(Lifetable!A20))","v":""},null,{"$f":"B19*Lifetable!$E19","v":0},{"$f":"C19*Lifetable!$E19","v":0},{"$f":"D19*Lifetable!$E19","v":0},{"$f":"E19*Lifetable!$E19","v":0},{"$f":"F19*Lifetable!$E19","v":0},{"$f":"G19*Lifetable!$E19","v":0},{"$f":"H19*Lifetable!$E19","v":0},{"$f":"I19*Lifetable!$E19","v":0},{"$f":"J19*Lifetable!$E19","v":0},{"$f":"K19*Lifetable!$E19","v":0},{"$f":"L19*Lifetable!$E19","v":0},{"$f":"M19*Lifetable!$E19","v":0},{"$f":"N19*Lifetable!$E19","v":0},{"$f":"O19*Lifetable!$E19","v":0},{"$f":"P19*Lifetable!$E19","v":0},{"$f":"Q19*Lifetable!$E19","v":0},{"$f":"R19*Lifetable!$E19","v":0},{"$f":"S19*Lifetable!$E19","v":0},{"$f":"T19*Lifetable!$E19","v":0},{"$f":"U19*Lifetable!$E19","v":0},{"$f":"V19*Lifetable!$E19","v":0},{"$f":"W19*Lifetable!$E19","v":0},{"$f":"X19*Lifetable!$E19","v":0},{"$f":"Y19*Lifetable!$E19","v":0},{"$f":"Z19*Lifetable!$E19","v":0},{"$f":"AA19*Lifetable!$E19","v":0},{"$f":"AB19*Lifetable!$E19","v":0},{"$f":"AC19*Lifetable!$E19","v":0},{"$f":"AD19*Lifetable!$E19","v":0},{"$f":"AE19*Lifetable!$E19","v":0},{"$f":"AF19*Lifetable!$E19","v":0},{"$f":"AG19*Lifetable!$E19","v":0},{"$f":"AH19*Lifetable!$E19","v":0},{"$f":"AI19*Lifetable!$E19","v":0},{"$f":"AJ19*Lifetable!$E19","v":0},{"$f":"AK19*Lifetable!$E19","v":0},{"$f":"AL19*Lifetable!$E19","v":0},{"$f":"AM19*Lifetable!$E19","v":0},{"$f":"AN19*Lifetable!$E19","v":0},{"$f":"AO19*Lifetable!$E19","v":0},{"$f":"AP19*Lifetable!$E19","v":0},{"$f":"AQ19*Lifetable!$E19","v":0},{"$f":"AR19*Lifetable!$E19","v":0},{"$f":"AS19*Lifetable!$E19","v":0},{"$f":"AT19*Lifetable!$E19","v":0},{"$f":"AU19*Lifetable!$E19","v":0},{"$f":"AV19*Lifetable!$E19","v":0},{"$f":"AW19*Lifetable!$E19","v":0},{"$f":"AX19*Lifetable!$E19","v":0},{"$f":"AY19*Lifetable!$E19","v":0},{"$f":"AZ19*Lifetable!$E19","v":0},{"$f":"BA19*Lifetable!$E19","v":0},null,{"$f":"Lifetable!$E20*Lifetable!$G21","v":0},0,0,0,0,0,0,0,0,0,0,0,0,0,0,0,0,0,0,0,0,0,0,0,0,0,0,0,0,0,0,0,0,0,0,0,0,0,0,0,0,0,0,0,0,0,0,0,0,0,0,0,0]
[{"$f":"IF(Lifetable!A21 = \"\", \"\", VALUE(Lifetable!A21))","v":""},null,{"$f":"B20*Lifetable!$E20","v":0},{"$f":"C20*Lifetable!$E20","v":0},{"$f":"D20*Lifetable!$E20","v":0},{"$f":"E20*Lifetable!$E20","v":0},{"$f":"F20*Lifetable!$E20","v":0},{"$f":"G20*Lifetable!$E20","v":0},{"$f":"H20*Lifetable!$E20","v":0},{"$f":"I20*Lifetable!$E20","v":0},{"$f":"J20*Lifetable!$E20","v":0},{"$f":"K20*Lifetable!$E20","v":0},{"$f":"L20*Lifetable!$E20","v":0},{"$f":"M20*Lifetable!$E20","v":0},{"$f":"N20*Lifetable!$E20","v":0},{"$f":"O20*Lifetable!$E20","v":0},{"$f":"P20*Lifetable!$E20","v":0},{"$f":"Q20*Lifetable!$E20","v":0},{"$f":"R20*Lifetable!$E20","v":0},{"$f":"S20*Lifetable!$E20","v":0},{"$f":"T20*Lifetable!$E20","v":0},{"$f":"U20*Lifetable!$E20","v":0},{"$f":"V20*Lifetable!$E20","v":0},{"$f":"W20*Lifetable!$E20","v":0},{"$f":"X20*Lifetable!$E20","v":0},{"$f":"Y20*Lifetable!$E20","v":0},{"$f":"Z20*Lifetable!$E20","v":0},{"$f":"AA20*Lifetable!$E20","v":0},{"$f":"AB20*Lifetable!$E20","v":0},{"$f":"AC20*Lifetable!$E20","v":0},{"$f":"AD20*Lifetable!$E20","v":0},{"$f":"AE20*Lifetable!$E20","v":0},{"$f":"AF20*Lifetable!$E20","v":0},{"$f":"AG20*Lifetable!$E20","v":0},{"$f":"AH20*Lifetable!$E20","v":0},{"$f":"AI20*Lifetable!$E20","v":0},{"$f":"AJ20*Lifetable!$E20","v":0},{"$f":"AK20*Lifetable!$E20","v":0},{"$f":"AL20*Lifetable!$E20","v":0},{"$f":"AM20*Lifetable!$E20","v":0},{"$f":"AN20*Lifetable!$E20","v":0},{"$f":"AO20*Lifetable!$E20","v":0},{"$f":"AP20*Lifetable!$E20","v":0},{"$f":"AQ20*Lifetable!$E20","v":0},{"$f":"AR20*Lifetable!$E20","v":0},{"$f":"AS20*Lifetable!$E20","v":0},{"$f":"AT20*Lifetable!$E20","v":0},{"$f":"AU20*Lifetable!$E20","v":0},{"$f":"AV20*Lifetable!$E20","v":0},{"$f":"AW20*Lifetable!$E20","v":0},{"$f":"AX20*Lifetable!$E20","v":0},{"$f":"AY20*Lifetable!$E20","v":0},{"$f":"AZ20*Lifetable!$E20","v":0},{"$f":"BA20*Lifetable!$E20","v":0},null,{"$f":"Lifetable!$E21*Lifetable!$G22","v":0},0,0,0,0,0,0,0,0,0,0,0,0,0,0,0,0,0,0,0,0,0,0,0,0,0,0,0,0,0,0,0,0,0,0,0,0,0,0,0,0,0,0,0,0,0,0,0,0,0,0,0,0]
[{"$f":"IF(Lifetable!A22 = \"\", \"\", VALUE(Lifetable!A22))","v":""},null,{"$f":"B21*Lifetable!$E21","v":0},{"$f":"C21*Lifetable!$E21","v":0},{"$f":"D21*Lifetable!$E21","v":0},{"$f":"E21*Lifetable!$E21","v":0},{"$f":"F21*Lifetable!$E21","v":0},{"$f":"G21*Lifetable!$E21","v":0},{"$f":"H21*Lifetable!$E21","v":0},{"$f":"I21*Lifetable!$E21","v":0},{"$f":"J21*Lifetable!$E21","v":0},{"$f":"K21*Lifetable!$E21","v":0},{"$f":"L21*Lifetable!$E21","v":0},{"$f":"M21*Lifetable!$E21","v":0},{"$f":"N21*Lifetable!$E21","v":0},{"$f":"O21*Lifetable!$E21","v":0},{"$f":"P21*Lifetable!$E21","v":0},{"$f":"Q21*Lifetable!$E21","v":0},{"$f":"R21*Lifetable!$E21","v":0},{"$f":"S21*Lifetable!$E21","v":0},{"$f":"T21*Lifetable!$E21","v":0},{"$f":"U21*Lifetable!$E21","v":0},{"$f":"V21*Lifetable!$E21","v":0},{"$f":"W21*Lifetable!$E21","v":0},{"$f":"X21*Lifetable!$E21","v":0},{"$f":"Y21*Lifetable!$E21","v":0},{"$f":"Z21*Lifetable!$E21","v":0},{"$f":"AA21*Lifetable!$E21","v":0},{"$f":"AB21*Lifetable!$E21","v":0},{"$f":"AC21*Lifetable!$E21","v":0},{"$f":"AD21*Lifetable!$E21","v":0},{"$f":"AE21*Lifetable!$E21","v":0},{"$f":"AF21*Lifetable!$E21","v":0},{"$f":"AG21*Lifetable!$E21","v":0},{"$f":"AH21*Lifetable!$E21","v":0},{"$f":"AI21*Lifetable!$E21","v":0},{"$f":"AJ21*Lifetable!$E21","v":0},{"$f":"AK21*Lifetable!$E21","v":0},{"$f":"AL21*Lifetable!$E21","v":0},{"$f":"AM21*Lifetable!$E21","v":0},{"$f":"AN21*Lifetable!$E21","v":0},{"$f":"AO21*Lifetable!$E21","v":0},{"$f":"AP21*Lifetable!$E21","v":0},{"$f":"AQ21*Lifetable!$E21","v":0},{"$f":"AR21*Lifetable!$E21","v":0},{"$f":"AS21*Lifetable!$E21","v":0},{"$f":"AT21*Lifetable!$E21","v":0},{"$f":"AU21*Lifetable!$E21","v":0},{"$f":"AV21*Lifetable!$E21","v":0},{"$f":"AW21*Lifetable!$E21","v":0},{"$f":"AX21*Lifetable!$E21","v":0},{"$f":"AY21*Lifetable!$E21","v":0},{"$f":"AZ21*Lifetable!$E21","v":0},{"$f":"BA21*Lifetable!$E21","v":0},null,{"$f":"Lifetable!$E22*Lifetable!$G23","v":0},0,0,0,0,0,0,0,0,0,0,0,0,0,0,0,0,0,0,0,0,0,0,0,0,0,0,0,0,0,0,0,0,0,0,0,0,0,0,0,0,0,0,0,0,0,0,0,0,0,0,0,0]
[null,{"$f":"SUM(B2:B21)","v":42},{"$f":"SUM(C2:C21)","v":54.2575},60.968625000000003,75.577499999999986,94.63724999999998,119.62559699999998,150.90976214999998,188.28617723999997,237.19471423199997,297.68789594519995,373.93714831913996,469.62385446456,589.76866432925272,740.78485732071488,930.31703153331375,1168.4425041651787,1467.472909608269,1843.0466984799314,2314.7430363545263,2907.1526817557124,3651.1881871562614,4585.6382858710222,5759.2472842699381,7233.2178386732239,9084.4235359846116,11409.411014015697,14329.434522303134,17996.783651574835,22602.721347142633,28387.462219136753,35652.698527892906,44777.33520651624,56237.250841855392,70630.115999077869,88706.563950524316,111409.338285259,139922.46013160382,175732.97849806951,220708.52457994386,277194.71461387246,348137.48112075374,437236.71257753571,549139.21422617452,689681.05359521043,866191.92977980222,1087877.4403099571,1366299.1820259027,1715977.7247265833,2155149.9045705441,2706719.932457428,3399453.9206878198,4269480.1262234459,5362173.1529541332]
[null,null,{"$f":"C23/B23","v":1.2918452380952381},1.1236902732341152,1.2396129976688828,1.2521881512354867,1.2640434606880484,1.2615173168164,1.2476739381038113,1.2597563863100714,1.2550359602618786,1.2561382354221631,1.2558898108292664,1.2558319998494867,1.2560600488383251,1.2558531972401576,1.255961639484763,1.2559222249936377,1.2559323490148238,1.2559329279413434,1.2559289027321876,1.2559327241633573,1.2559304124618567,1.2559314375089212,1.2559311107250244,1.2559311413813234,1.2559312067322159,1.2559311348062037,1.2559311830179785,1.2559311588526403,1.2559311678956484,1.2559311661138368,1.2559311652520404,1.2559311665708826,{"$f":"AI23/AH23","v":1.2559311655844738},1.255931166128659,1.2559311658988059,1.2559311659614938,1.2559311659670946,1.2559311659442933,1.255931165963952,1.2559311659520758,1.2559311659576158,1.255931165955775,1.2559311659559442,1.2559311659563002,1.255931165955922,1.255931165956174,1.2559311659560457,1.2559311659560946,1.2559311659560846,1.2559311659560801,1.2559311659560872,1.2559311659560821,null,null,{"$f":"SUM(BE2:BE23)","v":25.407499999999999},{"$f":"SUM(BF2:BF23)","v":22.727999999999998},{"$f":"SUM(BG2:BG23)","v":31.766999999999996},39.219599999999993,49.294556999999998,62.403494399999992,77.554254239999992,98.088423551999981,122.82977990519998,154.39743897983999,193.89330346319997,243.48033074753275,305.85321946659013,384.07769440683717,482.40861465815777,605.85657293409736,760.91818812665349,955.66276697271417,1200.2424523716504,1507.4260404983581,1893.2204250736274,2377.7560940543353,2986.2974327402017,3750.5839849552112,4710.4756001928763,5916.032793097238,7430.1302111414288,9331.7319523585247,11720.013054134952,14719.529650978962,18486.716019900538,23218.04282950332,29160.263581627041,36623.283852953064,45996.323584065976,57768.216310398224,72552.903266717447,91121.4523915592,114442.27194738614,143731.61604037901,180517.01611898144,226716.94652899526,284740.87899615354,357614.94415311294,449139.75377341115,564088.61463396787,708456.47147973196,889772.56225469871,1117493.0915482719,1403494.4014160836,1762692.3599833474,2213820.2708957586]
[]
[null,"years"]
[null,{"$f":"VALUE(MID(B1,2,2))","v":0},1,2,3,4,5,6,7,8,9,10,11,12,13,14,15,16,17,18,19,20,21,22,23,24,25,26,27,28,29,30,31,{"$f":"VALUE(MID(AH1,2,2))","v":32},33,34,35,36,37,38,39,40,41,42,43,44,45,46,47,48,49,50,51,52]

{"sheet":"Ageclass","index":2,"n_rows":40,"n_cols":57,"rows_kept":40,"cut":false,"hidden":false,"merged":[[39,1,39,59]]}
["X","y0","y1","y2","y3","y4","y5","y6","y7","y8","y9","y10","y11","y12","y13","y14","y15","y16","y17","y18","y19","y20","y21","y22","y23","y24","y25","y26","y27","y28","y29","y30","y31","y32","y33","y34","y35","y36","y37","y38","y39","y40","y41","y42","y43","y44","y45","y46","y47","y48","y49","y50","y51","y52",null,"stable","proportion"]
[{"$f":"IF(Lifetable!A2 = \"\", \"\", \"X\"&Lifetable!A2)","v":"X0"},{"$f":"Population!B2/Population!B$23","v":0.23809523809523808},{"$f":"Population!C2/Population!C$23","v":0.4682762751693314},{"$f":"Population!D2/Population!D$23","v":0.37278190216689316},{"$f":"Population!E2/Population!E$23","v":0.42032350898084747},{"$f":"Population!F2/Population!F$23","v":0.41442032603441037},{"$f":"Population!G2/Population!G$23","v":0.41207365510577143},{"$f":"Population!H2/Population!H$23","v":0.41351529225771827},{"$f":"Population!I2/Population!I$23","v":0.41189563342796559},{"$f":"Population!J2/Population!J$23","v":0.41353545280127857},{"$f":"Population!K2/Population!K$23","v":0.41261261065116056},{"$f":"Population!L2/Population!L$23","v":0.41289676533573},{"$f":"Population!M2/Population!M$23","v":0.41286936687717185},{"$f":"Population!N2/Population!N$23","v":0.41284039908163706},{"$f":"Population!O2/Population!O$23","v":0.41287725639102024},{"$f":"Population!P2/Population!P$23","v":0.41284603139406645},{"$f":"Population!Q2/Population!Q$23","v":0.41286465781457171},{"$f":"Population!R2/Population!R$23","v":0.4128570748851686},{"$f":"Population!S2/Population!S$23","v":0.41285887587885173},{"$f":"Population!T2/Population!T$23","v":0.4128591173894538},{"$f":"Population!U2/Population!U$23","v":0.41285841638244808},{"$f":"Population!V2/Population!V$23","v":0.41285903745005847},{"$f":"Population!W2/Population!W$23","v":0.41285864846926507},{"$f":"Population!X2/Population!X$23","v":0.41285882975517135},{"$f":"Population!Y2/Population!Y$23","v":0.41285877175903951},{"$f":"Population!Z2/Population!Z$23","v":0.41285877635478446},{"$f":"Population!AA2/Population!AA$23","v":0.41285878775042573},{"$f":"Population!AB2/Population!AB$23","v":0.41285877568226392},{"$f":"Population!AC2/Population!AC$23","v":0.41285878382447766},{"$f":"Population!AD2/Population!AD$23","v":0.41285877965921186},{"$f":"Population!AE2/Population!AE$23","v":0.41285878123456121},{"$f":"Population!AF2/Population!AF$23","v":0.41285878092686679},{"$f":"Population!AG2/Population!AG$23","v":0.41285878077912619},{"$f":"Population!AH2/Population!AH$23","v":0.41285878100255485},{"$f":"Population!AI2/Population!AI$23","v":0.41285878083518585},{"$f":"Population!AJ2/Population!AJ$23","v":0.41285878092831479},{"$f":"Population!AK2/Population!AK$23","v":0.41285878088867461},{"$f":"Population!AL2/Population!AL$23","v":0.41285878089953842},{"$f":"Population!AM2/Population!AM$23","v":0.41285878090044703},{"$f":"Population!AN2/Population!AN$23","v":0.41285878089658323},{"$f":"Population!AO2/Population!AO$23","v":0.41285878089992545},{"$f":"Population!AP2/Population!AP$23","v":0.41285878089789696},{"$f":"Population!AQ2/Population!AQ$23","v":0.41285878089884809},{"$f":"Population!AR2/Population!AR$23","v":0.41285878089853029},{"$f":"Population!AS2/Population!AS$23","v":0.41285878089856076},{"$f":"Population!AT2/Population!AT$23","v":0.41285878089862083},{"$f":"Population!AU2/Population!AU$23","v":0.4128587808985566},{"$f":"Population!AV2/Population!AV$23","v":0.41285878089859951},{"$f":"Population!AW2/Population!AW$23","v":0.41285878089857747},{"$f":"Population!AX2/Population!AX$23","v":0.41285878089858596},{"$f":"Population!AY2/Population!AY$23","v":0.41285878089858424},{"$f":"Population!AZ2/Population!AZ$23","v":0.41285878089858358},{"$f":"Population!BA2/Population!BA$23","v":0.41285878089858469},{"$f":"Population!BB2/Population!BB$23","v":0.4128587808985838},null,{"$f":"EXP(-r_est*Lifetable!A2)*Lifetable!F2","v":1},{"$f":"BD2/BD$23","v":0.40903029545757613}]
[{"$f":"IF(Lifetable!A3 = \"\", \"\", \"X\"&Lifetable!A3)","v":"X1"},{"$f":"Population!B3/Population!B$23","v":0.21428571428571427},{"$f":"Population!C3/Population!C$23","v":0.13822973782426393},{"$f":"Population!D3/Population!D$23","v":0.31254805237940003},{"$f":"Population!E3/Population!E$23","v":0.22554331646323314},{"$f":"Population!F3/Population!F$23","v":0.25175340576781341},{"$f":"Population!G3/Population!G$23","v":0.24588968195494146},{"$f":"Population!H3/Population!H$23","v":0.24498691948935661},{"$f":"Population!I3/Population!I$23","v":0.24857172993821414},{"$f":"Population!J3/Population!J$23","v":0.24522338479730277},{"$f":"Population!K3/Population!K$23","v":0.24712565967929875},{"$f":"Population!L3/Population!L$23","v":0.24635780462837933},{"$f":"Population!M3/Population!M$23","v":0.2465762293248642},{"$f":"Population!N3/Population!N$23","v":0.24657121748370089},{"$f":"Population!O3/Population!O$23","v":0.24650915344182098},{"$f":"Population!P3/Population!P$23","v":0.24657176728439628},{"$f":"Population!Q3/Population!Q$23","v":0.24653183171467896},{"$f":"Population!R3/Population!R$23","v":0.24655069175362146},{"$f":"Population!S3/Population!S$23","v":0.24654417605117498},{"$f":"Population!T3/Population!T$23","v":0.24654513789736415},{"$f":"Population!U3/Population!U$23","v":0.2465460722883917},{"$f":"Population!V3/Population!V$23","v":0.24654490350437047},{"$f":"Population!W3/Population!W$23","v":0.24654572818296808},{"$f":"Population!X3/Population!X$23","v":0.24654529467477343},{"$f":"Population!Y3/Population!Y$23","v":0.24654546708189037},{"$f":"Population!Z3/Population!Z$23","v":0.24654542643056107},{"$f":"Population!AA3/Population!AA$23","v":0.24654541634628666},{"$f":"Population!AB3/Population!AB$23","v":0.24654543727080935},{"$f":"Population!AC3/Population!AC$23","v":0.24654542059990037},{"$f":"Population!AD3/Population!AD$23","v":0.24654543020593148},{"$f":"Population!AE3/Population!AE$23","v":0.2465454259433876},{"$f":"Population!AF3/Population!AF$23","v":0.24654542723391179},{"$f":"Population!AG3/Population!AG$23","v":0.24654542721934181},{"$f":"Population!AH3/Population!AH$23","v":0.24654542687222092},{"$f":"Population!AI3/Population!AI$23","v":0.24654542719928191},{"$f":"Population!AJ3/Population!AJ$23","v":0.2465454269925085},{"$f":"Population!AK3/Population!AK$23","v":0.24654542709324329},{"$f":"Population!AL3/Population!AL$23","v":0.24654542705726559},{"$f":"Population!AM3/Population!AM$23","v":0.24654542706265359},{"$f":"Population!AN3/Population!AN$23","v":0.24654542706767221},{"$f":"Population!AO3/Population!AO$23","v":0.24654542706150576},{"$f":"Population!AP3/Population!AP$23","v":0.24654542706583299},{"$f":"Population!AQ3/Population!AQ$23","v":0.24654542706353411},{"$f":"Population!AR3/Population!AR$23","v":0.24654542706446347},{"$f":"Population!AS3/Population!AS$23","v":0.24654542706424043},{"$f":"Population!AT3/Population!AT$23","v":0.24654542706418875},{"$f":"Population!AU3/Population!AU$23","v":0.24654542706429891},{"$f":"Population!AV3/Population!AV$23","v":0.24654542706421101},{"$f":"Population!AW3/Population!AW$23","v":0.24654542706426189},{"$f":"Population!AX3/Population!AX$23","v":0.2465454270642391},{"$f":"Population!AY3/Population!AY$23","v":0.24654542706424612},{"$f":"Population!AZ3/Population!AZ$23","v":0.24654542706424598},{"$f":"Population!BA3/Population!BA$23","v":0.24654542706424418},{"$f":"Population!BB3/Population!BB$23","v":0.24654542706424587},null,{"$f":"EXP(-r_est*Lifetable!A3)*Lifetable!F3","v":0.60172310257092931},0.24612297842823658]
[{"$f":"IF(Lifetable!A4 = \"\", \"\", \"X\"&Lifetable!A4)","v":"X2"},{"$f":"Population!B4/Population!B$23","v":0.19047619047619047},{"$f":"Population!C4/Population!C$23","v":0.13270054831129338},{"$f":"Population!D4/Population!D$23","v":9.8411273011323436E-2},{"$f":"Population!E4/Population!E$23","v":0.20170685719956341},{"$f":"Population!F4/Population!F$23","v":0.14409548037374292},{"$f":"Population!G4/Population!G$23","v":0.15933212019832177},{"$f":"Population!H4/Population!H$23","v":0.1559326558119554},{"$f":"Population!I4/Population!I$23","v":0.15708393804341708},{"$f":"Population!J4/Population!J$23","v":0.15785384071998296},{"$f":"Population!K4/Population!K$23","v":0.15631321655270111},{"$f":"Population!L4/Population!L$23","v":0.15738755669434407},{"$f":"Population!M4/Population!M$23","v":0.15692956659355892},{"$f":"Population!N4/Population!N$23","v":0.15707593331236452},{"$f":"Population!O4/Population!O$23","v":0.15704422266228041},{"$f":"Population!P4/Population!P$23","v":0.15703055356058843},{"$f":"Population!Q4/Population!Q$23","v":0.15705687787442182},{"$f":"Population!R4/Population!R$23","v":0.15703636853208988},{"$f":"Population!S4/Population!S$23","v":0.15704711607883676},{"$f":"Population!T4/Population!T$23","v":0.15704289333685789},{"$f":"Population!U4/Population!U$23","v":0.15704400932952306},{"$f":"Population!V4/Population!V$23","v":0.15704412667653292},{"$f":"Population!W4/Population!W$23","v":0.15704367124678301},{"$f":"Population!X4/Population!X$23","v":0.15704406837492946},{"$f":"Population!Y4/Population!Y$23","v":0.15704383310160866},{"$f":"Population!Z4/Population!Z$23","v":0.15704393908776226},{"$f":"Population!AA4/Population!AA$23","v":0.15704390502218227},{"$f":"Population!AB4/Population!AB$23","v":0.15704390759248424},{"$f":"Population!AC4/Population!AC$23","v":0.15704391489244843},{"$f":"Population!AD4/Population!AD$23","v":0.15704390729513085},{"$f":"Population!AE4/Population!AE$23","v":0.15704391228320319},{"$f":"Population!AF4/Population!AF$23","v":0.1570439097908593},{"$f":"Population!AG4/Population!AG$23","v":0.15704391072065485},{"$f":"Population!AH4/Population!AH$23","v":0.15704391054646369},{"$f":"Population!AI4/Population!AI$23","v":0.15704391044869781},{"$f":"Population!AJ4/Population!AJ$23","v":0.15704391058898243},{"$f":"Population!AK4/Population!AK$23","v":0.15704391048601363},{"$f":"Population!AL4/Population!AL$23","v":0.15704391054234085},{"$f":"Population!AM4/Population!AM$23","v":0.15704391051872349},{"$f":"Population!AN4/Population!AN$23","v":0.15704391052500666},{"$f":"Population!AO4/Population!AO$23","v":0.15704391052574523},{"$f":"Population!AP4/Population!AP$23","v":0.15704391052330238},{"$f":"Population!AQ4/Population!AQ$23","v":0.15704391052536598},{"$f":"Population!AR4/Population!AR$23","v":0.15704391052413183},{"$f":"Population!AS4/Population!AS$23","v":0.15704391052470265},{"$f":"Population!AT4/Population!AT$23","v":0.15704391052451608},{"$f":"Population!AU4/Population!AU$23","v":0.15704391052453046},{"$f":"Population!AV4/Population!AV$23","v":0.15704391052456909},{"$f":"Population!AW4/Population!AW$23","v":0.15704391052452915},{"$f":"Population!AX4/Population!AX$23","v":0.15704391052455544},{"$f":"Population!AY4/Population!AY$23","v":0.15704391052454217},{"$f":"Population!AZ4/Population!AZ$23","v":0.15704391052454722},{"$f":"Population!BA4/Population!BA$23","v":0.15704391052454625},{"$f":"Population!BB4/Population!BB$23","v":0.15704391052454572},null,{"$f":"EXP(-r_est*Lifetable!A4)*Lifetable!F4","v":0.38620873831209085},0.15797107434009222]
[{"$f":"IF(Lifetable!A5 = \"\", \"\", \"X\"&Lifetable!A5)","v":"X3"},{"$f":"Population!B5/Population!B$23","v":0.16666666666666666},{"$f":"Population!C5/Population!C$23","v":0.11795604294337189},{"$f":"Population!D5/Population!D$23","v":9.4474822090870519E-2},{"$f":"Population!E5/Population!E$23","v":6.3510965565148375E-2},{"$f":"Population!F5/Population!F$23","v":0.12886680456162877},{"$f":"Population!G5/Population!G$23","v":9.1196535470581624E-2},{"$f":"Population!H5/Population!H$23","v":0.10104157466528749},{"$f":"Population!I5/Population!I$23","v":9.998295294935057E-2},{"$f":"Population!J5/Population!J$23","v":9.9755120752213808E-2},{"$f":"Population!K5/Population!K$23","v":0.10062107905628127},{"$f":"Population!L5/Population!L$23","v":9.9551601659616629E-2},{"$f":"Population!M5/Population!M$23","v":0.10025564684877619},{"$f":"Population!N5/Population!N$23","v":9.9968509553741036E-2},{"$f":"Population!O5/Population!O$23","v":0.1000435821250025},{"$f":"Population!P5/Population!P$23","v":0.10003986007753023},{"$f":"Population!Q5/Population!Q$23","v":0.10002251573543762},{"$f":"Population!R5/Population!R$23","v":0.10004242285000885},{"$f":"Population!S5/Population!S$23","v":0.10002855243295362},{"$f":"Population!T5/Population!T$23","v":0.10003535226121339},{"$f":"Population!U5/Population!U$23","v":0.10003298307426275},{"$f":"Population!V5/Population!V$23","v":0.1000333895649631},{"$f":"Population!W5/Population!W$23","v":0.10003364843674567},{"$f":"Population!X5/Population!X$23","v":0.10003327669432113},{"$f":"Population!Y5/Population!Y$23","v":0.10003355568397124},{"$f":"Population!Z5/Population!Z$23","v":0.10003340337839578},{"$f":"Population!AA5/Population!AA$23","v":0.10003346568407803},{"$f":"Population!AB5/Population!AB$23","v":0.1000334497138905},{"$f":"Population!AC5/Population!AC$23","v":0.10003344751110378},{"$f":"Population!AD5/Population!AD$23","v":0.10003345408575826},{"$f":"Population!AE5/Population!AE$23","v":0.1000334485261722},{"$f":"Population!AF5/Population!AF$23","v":0.10003345184538169},{"$f":"Population!AG5/Population!AG$23","v":0.10003345032645557},{"$f":"Population!AH5/Population!AH$23","v":0.10003345081367025},{"$f":"Population!AI5/Population!AI$23","v":0.1000334507812807},{"$f":"Population!AJ5/Population!AJ$23","v":0.1000334506756623},{"$f":"Population!AK5/Population!AK$23","v":0.100033450783328},{"$f":"Population!AL5/Population!AL$23","v":0.10003345071274616},{"$f":"Population!AM5/Population!AM$23","v":0.10003345074817921},{"$f":"Population!AN5/Population!AN$23","v":0.10003345073495161},{"$f":"Population!AO5/Population!AO$23","v":0.10003345073738805},{"$f":"Population!AP5/Population!AP$23","v":0.10003345073880444},{"$f":"Population!AQ5/Population!AQ$23","v":0.10003345073680714},{"$f":"Population!AR5/Population!AR$23","v":0.10003345073826822},{"$f":"Population!AS5/Population!AS$23","v":0.10003345073746861},{"$f":"Population!AT5/Population!AT$23","v":0.10003345073780386},{"$f":"Population!AU5/Population!AU$23","v":0.10003345073771513},{"$f":"Population!AV5/Population!AV$23","v":0.10003345073770421},{"$f":"Population!AW5/Population!AW$23","v":0.10003345073773906},{"$f":"Population!AX5/Population!AX$23","v":0.10003345073770974},{"$f":"Population!AY5/Population!AY$23","v":0.10003345073772726},{"$f":"Population!AZ5/Population!AZ$23","v":0.10003345073771919},{"$f":"Population!BA5/Population!BA$23","v":0.10003345073772182},{"$f":"Population!BB5/Population!BB$23","v":0.1000334507377216},null,{"$f":"EXP(-r_est*Lifetable!A5)*Lifetable!F5","v":0.24788343494096582},0.10139183463294209]
[{"$f":"IF(Lifetable!A6 = \"\", \"\", \"X\"&Lifetable!A6)","v":"X4"},{"$f":"Population!B6/Population!B$23","v":0.11904761904761904},{"$f":"Population!C6/Population!C$23","v":9.6760816476984743E-2},{"$f":"Population!D6/Population!D$23","v":7.8729018409058771E-2},{"$f":"Population!E6/Population!E$23","v":5.7159869008633533E-2},{"$f":"Population!F6/Population!F$23","v":3.8039989539002887E-2},{"$f":"Population!G6/Population!G$23","v":7.6461060420037044E-2},{"$f":"Population!H6/Population!H$23","v":5.4218361247347593E-2},{"$f":"Population!I6/Population!I$23","v":6.0737969019482974E-2},{"$f":"Population!J6/Population!J$23","v":5.9525171316381707E-2},{"$f":"Population!K6/Population!K$23","v":5.9612905871277988E-2},{"$f":"Population!L6/Population!L$23","v":6.007763092001446E-2},{"$f":"Population!M6/Population!M$23","v":5.9450837645869496E-2},{"$f":"Population!N6/Population!N$23","v":5.9874039796401088E-2},{"$f":"Population!O6/Population!O$23","v":5.9691717951421315E-2},{"$f":"Population!P6/Population!P$23","v":5.9746383381945017E-2},{"$f":"Population!Q6/Population!Q$23","v":5.9739002131408578E-2},{"$f":"Population!R6/Population!R$23","v":5.9730519381451533E-2},{"$f":"Population!S6/Population!S$23","v":5.9741925746528445E-2},{"$f":"Population!T6/Population!T$23","v":5.9733615271705814E-2},{"$f":"Population!U6/Population!U$23","v":5.9737867352757774E-2},{"$f":"Population!V6/Population!V$23","v":5.9736270790837931E-2},{"$f":"Population!W6/Population!W$23","v":5.9736623485897852E-2},{"$f":"Population!X6/Population!X$23","v":5.973672932048596E-2},{"$f":"Population!Y6/Population!Y$23","v":5.9736522871410055E-2},{"$f":"Population!Z6/Population!Z$23","v":5.9736688016560159E-2},{"$f":"Population!AA6/Population!AA$23","v":5.9736593956450146E-2},{"$f":"Population!AB6/Population!AB$23","v":5.9736634584375725E-2},{"$f":"Population!AC6/Population!AC$23","v":5.9736622754388527E-2},{"$f":"Population!AD6/Population!AD$23","v":5.9736622588348894E-2},{"$f":"Population!AE6/Population!AE$23","v":5.9736626084394062E-2},{"$f":"Population!AF6/Population!AF$23","v":5.9736622849145E-2},{"$f":"Population!AG6/Population!AG$23","v":5.9736624872255825E-2},{"$f":"Population!AH6/Population!AH$23","v":5.9736623902475146E-2},{"$f":"Population!AI6/Population!AI$23","v":5.9736624240340597E-2},{"$f":"Population!AJ6/Population!AJ$23","v":5.9736624195115225E-2},{"$f":"Population!AK6/Population!AK$23","v":5.9736624142976091E-2},{"$f":"Population!AL6/Population!AL$23","v":5.9736624204288775E-2},{"$f":"Population!AM6/Population!AM$23","v":5.9736624161873274E-2},{"$f":"Population!AN6/Population!AN$23","v":5.9736624184117217E-2},{"$f":"Population!AO6/Population!AO$23","v":5.9736624175283096E-2},{"$f":"Population!AP6/Population!AP$23","v":5.9736624177302938E-2},{"$f":"Population!AQ6/Population!AQ$23","v":5.973662417788525E-2},{"$f":"Population!AR6/Population!AR$23","v":5.9736624176780086E-2},{"$f":"Population!AS6/Population!AS$23","v":5.9736624177644547E-2},{"$f":"Population!AT6/Population!AT$23","v":5.9736624177150116E-2},{"$f":"Population!AU6/Population!AU$23","v":5.9736624177368303E-2},{"$f":"Population!AV6/Population!AV$23","v":5.9736624177303334E-2},{"$f":"Population!AW6/Population!AW$23","v":5.9736624177302911E-2},{"$f":"Population!AX6/Population!AX$23","v":5.9736624177321403E-2},{"$f":"Population!AY6/Population!AY$23","v":5.9736624177304354E-2},{"$f":"Population!AZ6/Population!AZ$23","v":5.973662417731504E-2},{"$f":"Population!BA6/Population!BA$23","v":5.9736624177309877E-2},{"$f":"Population!BB6/Population!BB$23","v":5.9736624177311702E-2},null,{"$f":"EXP(-r_est*Lifetable!A6)*Lifetable!F6","v":0.14915718954861709},6.1009809310692532E-2]
[{"$f":"IF(Lifetable!A7 = \"\", \"\", \"X\"&Lifetable!A7)","v":"X5"},{"$f":"Population!B7/Population!B$23","v":7.1428571428571425E-2},{"$f":"Population!C7/Population!C$23","v":4.6076579274754642E-2},{"$f":"Population!D7/Population!D$23","v":4.3054931942454008E-2},{"$f":"Population!E7/Population!E$23","v":3.1755482782574188E-2},{"$f":"Population!F7/Population!F$23","v":2.2823993723401732E-2},{"$f":"Population!G7/Population!G$23","v":1.5046946850346757E-2},{"$f":"Population!H7/Population!H$23","v":3.030519652833474E-2},{"$f":"Population!I7/Population!I$23","v":2.1727776621569699E-2},{"$f":"Population!J7/Population!J$23","v":2.4107029612840232E-2},{"$f":"Population!K7/Population!K$23","v":2.371452818928035E-2},{"$f":"Population!L7/Population!L$23","v":2.3728640761915536E-2},{"$f":"Population!M7/Population!M$23","v":2.3918352709759262E-2},{"$f":"Population!N7/Population!N$23","v":2.3669900772155337E-2},{"$f":"Population!O7/Population!O$23","v":2.3834067428454543E-2},{"$f":"Population!P7/Population!P$23","v":2.3765404301473635E-2},{"$f":"Population!Q7/Population!Q$23","v":2.3785114729481291E-2},{"$f":"Population!R7/Population!R$23","v":2.3782922597659743E-2},{"$f":"Population!S7/Population!S$23","v":2.3779353811654445E-2},{"$f":"Population!T7/Population!T$23","v":2.3783883843404817E-2},{"$f":"Population!U7/Population!U$23","v":2.3780651572616655E-2},{"$f":"Population!V7/Population!V$23","v":2.3782272013237137E-2},{"$f":"Population!W7/Population!W$23","v":2.3781680178340356E-2},{"$f":"Population!X7/Population!X$23","v":2.3781801180318623E-2},{"$f":"Population!Y7/Population!Y$23","v":2.3781849502080218E-2},{"$f":"Population!Z7/Population!Z$23","v":2.3781766731936209E-2},{"$f":"Population!AA7/Population!AA$23","v":2.3781831240577235E-2},{"$f":"Population!AB7/Population!AB$23","v":2.3781795156176216E-2},{"$f":"Population!AC7/Population!AC$23","v":2.3781810417681383E-2},{"$f":"Population!AD7/Population!AD$23","v":2.3781806165618626E-2},{"$f":"Population!AE7/Population!AE$23","v":2.3781805928281663E-2},{"$f":"Population!AF7/Population!AF$23","v":2.3781807353835335E-2},{"$f":"Population!AG7/Population!AG$23","v":2.3781806082165759E-2},{"$f":"Population!AH7/Population!AH$23","v":2.3781806862615346E-2},{"$f":"Population!AI7/Population!AI$23","v":2.3781806495213241E-2},{"$f":"Population!AJ7/Population!AJ$23","v":2.3781806619416718E-2},{"$f":"Population!AK7/Population!AK$23","v":2.3781806605764403E-2},{"$f":"Population!AL7/Population!AL$23","v":2.378180658382021E-2},{"$f":"Population!AM7/Population!AM$23","v":2.3781806608123408E-2},{"$f":"Population!AN7/Population!AN$23","v":2.3781806591669088E-2},{"$f":"Population!AO7/Population!AO$23","v":2.3781806600152396E-2},{"$f":"Population!AP7/Population!AP$23","v":2.3781806596860317E-2},{"$f":"Population!AQ7/Population!AQ$23","v":2.3781806597559536E-2},{"$f":"Population!AR7/Population!AR$23","v":2.3781806597826218E-2},{"$f":"Population!AS7/Population!AS$23","v":2.3781806597383034E-2},{"$f":"Population!AT7/Population!AT$23","v":2.3781806597720445E-2},{"$f":"Population!AU7/Population!AU$23","v":2.378180659753077E-2},{"$f":"Population!AV7/Population!AV$23","v":2.3781806597612858E-2},{"$f":"Population!AW7/Population!AW$23","v":2.3781806597589425E-2},{"$f":"Population!AX7/Population!AX$23","v":2.3781806597588332E-2},{"$f":"Population!AY7/Population!AY$23","v":2.3781806597595882E-2},{"$f":"Population!AZ7/Population!AZ$23","v":2.3781806597589182E-2},{"$f":"Population!BA7/Population!BA$23","v":2.3781806597593297E-2},{"$f":"Population!BB7/Population!BB$23","v":2.378180659759134E-2},null,{"$f":"EXP(-r_est*Lifetable!A7)*Lifetable!F7","v":5.9834217910636041E-2},2.4474007830460453E-2]
[{"$f":"IF(Lifetable!A8 = \"\", \"\", \"X\"&Lifetable!A8)","v":""},{"$f":"Population!B8/Population!B$23","v":0},{"$f":"Population!C8/Population!C$23","v":0},{"$f":"Population!D8/Population!D$23","v":0},{"$f":"Population!E8/Population!E$23","v":0},{"$f":"Population!F8/Population!F$23","v":0},{"$f":"Population!G8/Population!G$23","v":0},{"$f":"Population!H8/Population!H$23","v":0},{"$f":"Population!I8/Population!I$23","v":0},{"$f":"Population!J8/Population!J$23","v":0},{"$f":"Population!K8/Population!K$23","v":0},{"$f":"Population!L8/Population!L$23","v":0},{"$f":"Population!M8/Population!M$23","v":0},{"$f":"Population!N8/Population!N$23","v":0},{"$f":"Population!O8/Population!O$23","v":0},{"$f":"Population!P8/Population!P$23","v":0},{"$f":"Population!Q8/Population!Q$23","v":0},{"$f":"Population!R8/Population!R$23","v":0},{"$f":"Population!S8/Population!S$23","v":0},{"$f":"Population!T8/Population!T$23","v":0},{"$f":"Population!U8/Population!U$23","v":0},{"$f":"Population!V8/Population!V$23","v":0},{"$f":"Population!W8/Population!W$23","v":0},{"$f":"Population!X8/Population!X$23","v":0},{"$f":"Population!Y8/Population!Y$23","v":0},{"$f":"Population!Z8/Population!Z$23","v":0},{"$f":"Population!AA8/Population!AA$23","v":0},{"$f":"Population!AB8/Population!AB$23","v":0},{"$f":"Population!AC8/Population!AC$23","v":0},{"$f":"Population!AD8/Population!AD$23","v":0},{"$f":"Population!AE8/Population!AE$23","v":0},{"$f":"Population!AF8/Population!AF$23","v":0},{"$f":"Population!AG8/Population!AG$23","v":0},{"$f":"Population!AH8/Population!AH$23","v":0},{"$f":"Population!AI8/Population!AI$23","v":0},{"$f":"Population!AJ8/Population!AJ$23","v":0},{"$f":"Population!AK8/Population!AK$23","v":0},{"$f":"Population!AL8/Population!AL$23","v":0},{"$f":"Population!AM8/Population!AM$23","v":0},{"$f":"Population!AN8/Population!AN$23","v":0},{"$f":"Population!AO8/Population!AO$23","v":0},{"$f":"Population!AP8/Population!AP$23","v":0},{"$f":"Population!AQ8/Population!AQ$23","v":0},{"$f":"Population!AR8/Population!AR$23","v":0},{"$f":"Population!AS8/Population!AS$23","v":0},{"$f":"Population!AT8/Population!AT$23","v":0},{"$f":"Population!AU8/Population!AU$23","v":0},{"$f":"Population!AV8/Population!AV$23","v":0},{"$f":"Population!AW8/Population!AW$23","v":0},{"$f":"Population!AX8/Population!AX$23","v":0},{"$f":"Population!AY8/Population!AY$23","v":0},{"$f":"Population!AZ8/Population!AZ$23","v":0},{"$f":"Population!BA8/Population!BA$23","v":0},{"$f":"Population!BB8/Population!BB$23","v":0},null,{"$f":"EXP(-r_est*Lifetable!A8)*Lifetable!F8","v":0},0]
[{"$f":"IF(Lifetable!A9 = \"\", \"\", \"X\"&Lifetable!A9)","v":""},{"$f":"Population!B9/Population!B$23","v":0},{"$f":"Population!C9/Population!C$23","v":0},{"$f":"Population!D9/Population!D$23","v":0},{"$f":"Population!E9/Population!E$23","v":0},{"$f":"Population!F9/Population!F$23","v":0},{"$f":"Population!G9/Population!G$23","v":0},{"$f":"Population!H9/Population!H$23","v":0},{"$f":"Population!I9/Population!I$23","v":0},{"$f":"Population!J9/Population!J$23","v":0},{"$f":"Population!K9/Population!K$23","v":0},{"$f":"Population!L9/Population!L$23","v":0},{"$f":"Population!M9/Population!M$23","v":0},{"$f":"Population!N9/Population!N$23","v":0},{"$f":"Population!O9/Population!O$23","v":0},{"$f":"Population!P9/Population!P$23","v":0},{"$f":"Population!Q9/Population!Q$23","v":0},{"$f":"Population!R9/Population!R$23","v":0},{"$f":"Population!S9/Population!S$23","v":0},{"$f":"Population!T9/Population!T$23","v":0},{"$f":"Population!U9/Population!U$23","v":0},{"$f":"Population!V9/Population!V$23","v":0},{"$f":"Population!W9/Population!W$23","v":0},{"$f":"Population!X9/Population!X$23","v":0},{"$f":"Population!Y9/Population!Y$23","v":0},{"$f":"Population!Z9/Population!Z$23","v":0},{"$f":"Population!AA9/Population!AA$23","v":0},{"$f":"Population!AB9/Population!AB$23","v":0},{"$f":"Population!AC9/Population!AC$23","v":0},{"$f":"Population!AD9/Population!AD$23","v":0},{"$f":"Population!AE9/Population!AE$23","v":0},{"$f":"Population!AF9/Population!AF$23","v":0},{"$f":"Population!AG9/Population!AG$23","v":0},{"$f":"Population!AH9/Population!AH$23","v":0},{"$f":"Population!AI9/Population!AI$23","v":0},{"$f":"Population!AJ9/Population!AJ$23","v":0},{"$f":"Population!AK9/Population!AK$23","v":0},{"$f":"Population!AL9/Population!AL$23","v":0},{"$f":"Population!AM9/Population!AM$23","v":0},{"$f":"Population!AN9/Population!AN$23","v":0},{"$f":"Population!AO9/Population!AO$23","v":0},{"$f":"Population!AP9/Population!AP$23","v":0},{"$f":"Population!AQ9/Population!AQ$23","v":0},{"$f":"Population!AR9/Population!AR$23","v":0},{"$f":"Population!AS9/Population!AS$23","v":0},{"$f":"Population!AT9/Population!AT$23","v":0},{"$f":"Population!AU9/Population!AU$23","v":0},{"$f":"Population!AV9/Population!AV$23","v":0},{"$f":"Population!AW9/Population!AW$23","v":0},{"$f":"Population!AX9/Population!AX$23","v":0},{"$f":"Population!AY9/Population!AY$23","v":0},{"$f":"Population!AZ9/Population!AZ$23","v":0},{"$f":"Population!BA9/Population!BA$23","v":0},{"$f":"Population!BB9/Population!BB$23","v":0},null,{"$f":"EXP(-r_est*Lifetable!A9)*Lifetable!F9","v":0},0]
[{"$f":"IF(Lifetable!A10 = \"\", \"\", \"X\"&Lifetable!A10)","v":""},{"$f":"Population!B10/Population!B$23","v":0},{"$f":"Population!C10/Population!C$23","v":0},{"$f":"Population!D10/Population!D$23","v":0},{"$f":"Population!E10/Population!E$23","v":0},{"$f":"Population!F10/Population!F$23","v":0},{"$f":"Population!G10/Population!G$23","v":0},{"$f":"Population!H10/Population!H$23","v":0},{"$f":"Population!I10/Population!I$23","v":0},{"$f":"Population!J10/Population!J$23","v":0},{"$f":"Population!K10/Population!K$23","v":0},{"$f":"Population!L10/Population!L$23","v":0},{"$f":"Population!M10/Population!M$23","v":0},{"$f":"Population!N10/Population!N$23","v":0},{"$f":"Population!O10/Population!O$23","v":0},{"$f":"Population!P10/Population!P$23","v":0},{"$f":"Population!Q10/Population!Q$23","v":0},{"$f":"Population!R10/Population!R$23","v":0},{"$f":"Population!S10/Population!S$23","v":0},{"$f":"Population!T10/Population!T$23","v":0},{"$f":"Population!U10/Population!U$23","v":0},{"$f":"Population!V10/Population!V$23","v":0},{"$f":"Population!W10/Population!W$23","v":0},{"$f":"Population!X10/Population!X$23","v":0},{"$f":"Population!Y10/Population!Y$23","v":0},{"$f":"Population!Z10/Population!Z$23","v":0},{"$f":"Population!AA10/Population!AA$23","v":0},{"$f":"Population!AB10/Population!AB$23","v":0},{"$f":"Population!AC10/Population!AC$23","v":0},{"$f":"Population!AD10/Population!AD$23","v":0},{"$f":"Population!AE10/Population!AE$23","v":0},{"$f":"Population!AF10/Population!AF$23","v":0},{"$f":"Population!AG10/Population!AG$23","v":0},{"$f":"Population!AH10/Population!AH$23","v":0},{"$f":"Population!AI10/Population!AI$23","v":0},{"$f":"Population!AJ10/Population!AJ$23","v":0},{"$f":"Population!AK10/Population!AK$23","v":0},{"$f":"Population!AL10/Population!AL$23","v":0},{"$f":"Population!AM10/Population!AM$23","v":0},{"$f":"Population!AN10/Population!AN$23","v":0},{"$f":"Population!AO10/Population!AO$23","v":0},{"$f":"Population!AP10/Population!AP$23","v":0},{"$f":"Population!AQ10/Population!AQ$23","v":0},{"$f":"Population!AR10/Population!AR$23","v":0},{"$f":"Population!AS10/Population!AS$23","v":0},{"$f":"Population!AT10/Population!AT$23","v":0},{"$f":"Population!AU10/Population!AU$23","v":0},{"$f":"Population!AV10/Population!AV$23","v":0},{"$f":"Population!AW10/Population!AW$23","v":0},{"$f":"Population!AX10/Population!AX$23","v":0},{"$f":"Population!AY10/Population!AY$23","v":0},{"$f":"Population!AZ10/Population!AZ$23","v":0},{"$f":"Population!BA10/Population!BA$23","v":0},{"$f":"Population!BB10/Population!BB$23","v":0},null,{"$f":"EXP(-r_est*Lifetable!A10)*Lifetable!F10","v":0},0]
[{"$f":"IF(Lifetable!A11 = \"\", \"\", \"X\"&Lifetable!A11)","v":""},{"$f":"Population!B11/Population!B$23","v":0},{"$f":"Population!C11/Population!C$23","v":0},{"$f":"Population!D11/Population!D$23","v":0},{"$f":"Population!E11/Population!E$23","v":0},{"$f":"Population!F11/Population!F$23","v":0},{"$f":"Population!G11/Population!G$23","v":0},{"$f":"Population!H11/Population!H$23","v":0},{"$f":"Population!I11/Population!I$23","v":0},{"$f":"Population!J11/Population!J$23","v":0},{"$f":"Population!K11/Population!K$23","v":0},{"$f":"Population!L11/Population!L$23","v":0},{"$f":"Population!M11/Population!M$23","v":0},{"$f":"Population!N11/Population!N$23","v":0},{"$f":"Population!O11/Population!O$23","v":0},{"$f":"Population!P11/Population!P$23","v":0},{"$f":"Population!Q11/Population!Q$23","v":0},{"$f":"Population!R11/Population!R$23","v":0},{"$f":"Population!S11/Population!S$23","v":0},{"$f":"Population!T11/Population!T$23","v":0},{"$f":"Population!U11/Population!U$23","v":0},{"$f":"Population!V11/Population!V$23","v":0},{"$f":"Population!W11/Population!W$23","v":0},{"$f":"Population!X11/Population!X$23","v":0},{"$f":"Population!Y11/Population!Y$23","v":0},{"$f":"Population!Z11/Population!Z$23","v":0},{"$f":"Population!AA11/Population!AA$23","v":0},{"$f":"Population!AB11/Population!AB$23","v":0},{"$f":"Population!AC11/Population!AC$23","v":0},{"$f":"Population!AD11/Population!AD$23","v":0},{"$f":"Population!AE11/Population!AE$23","v":0},{"$f":"Population!AF11/Population!AF$23","v":0},{"$f":"Population!AG11/Population!AG$23","v":0},{"$f":"Population!AH11/Population!AH$23","v":0},{"$f":"Population!AI11/Population!AI$23","v":0},{"$f":"Population!AJ11/Population!AJ$23","v":0},{"$f":"Population!AK11/Population!AK$23","v":0},{"$f":"Population!AL11/Population!AL$23","v":0},{"$f":"Population!AM11/Population!AM$23","v":0},{"$f":"Population!AN11/Population!AN$23","v":0},{"$f":"Population!AO11/Population!AO$23","v":0},{"$f":"Population!AP11/Population!AP$23","v":0},{"$f":"Population!AQ11/Population!AQ$23","v":0},{"$f":"Population!AR11/Population!AR$23","v":0},{"$f":"Population!AS11/Population!AS$23","v":0},{"$f":"Population!AT11/Population!AT$23","v":0},{"$f":"Population!AU11/Population!AU$23","v":0},{"$f":"Population!AV11/Population!AV$23","v":0},{"$f":"Population!AW11/Population!AW$23","v":0},{"$f":"Population!AX11/Population!AX$23","v":0},{"$f":"Population!AY11/Population!AY$23","v":0},{"$f":"Population!AZ11/Population!AZ$23","v":0},{"$f":"Population!BA11/Population!BA$23","v":0},{"$f":"Population!BB11/Population!BB$23","v":0},null,{"$f":"EXP(-r_est*Lifetable!A11)*Lifetable!F11","v":0},0]
[{"$f":"IF(Lifetable!A12 = \"\", \"\", \"X\"&Lifetable!A12)","v":""},{"$f":"Population!B12/Population!B$23","v":0},{"$f":"Population!C12/Population!C$23","v":0},{"$f":"Population!D12/Population!D$23","v":0},{"$f":"Population!E12/Population!E$23","v":0},{"$f":"Population!F12/Population!F$23","v":0},{"$f":"Population!G12/Population!G$23","v":0},{"$f":"Population!H12/Population!H$23","v":0},{"$f":"Population!I12/Population!I$23","v":0},{"$f":"Population!J12/Population!J$23","v":0},{"$f":"Population!K12/Population!K$23","v":0},{"$f":"Population!L12/Population!L$23","v":0},{"$f":"Population!M12/Population!M$23","v":0},{"$f":"Population!N12/Population!N$23","v":0},{"$f":"Population!O12/Population!O$23","v":0},{"$f":"Population!P12/Population!P$23","v":0},{"$f":"Population!Q12/Population!Q$23","v":0},{"$f":"Population!R12/Population!R$23","v":0},{"$f":"Population!S12/Population!S$23","v":0},{"$f":"Population!T12/Population!T$23","v":0},{"$f":"Population!U12/Population!U$23","v":0},{"$f":"Population!V12/Population!V$23","v":0},{"$f":"Population!W12/Population!W$23","v":0},{"$f":"Population!X12/Population!X$23","v":0},{"$f":"Population!Y12/Population!Y$23","v":0},{"$f":"Population!Z12/Population!Z$23","v":0},{"$f":"Population!AA12/Population!AA$23","v":0},{"$f":"Population!AB12/Population!AB$23","v":0},{"$f":"Population!AC12/Population!AC$23","v":0},{"$f":"Population!AD12/Population!AD$23","v":0},{"$f":"Population!AE12/Population!AE$23","v":0},{"$f":"Population!AF12/Population!AF$23","v":0},{"$f":"Population!AG12/Population!AG$23","v":0},{"$f":"Population!AH12/Population!AH$23","v":0},{"$f":"Population!AI12/Population!AI$23","v":0},{"$f":"Population!AJ12/Population!AJ$23","v":0},{"$f":"Population!AK12/Population!AK$23","v":0},{"$f":"Population!AL12/Population!AL$23","v":0},{"$f":"Population!AM12/Population!AM$23","v":0},{"$f":"Population!AN12/Population!AN$23","v":0},{"$f":"Population!AO12/Population!AO$23","v":0},{"$f":"Population!AP12/Population!AP$23","v":0},{"$f":"Population!AQ12/Population!AQ$23","v":0},{"$f":"Population!AR12/Population!AR$23","v":0},{"$f":"Population!AS12/Population!AS$23","v":0},{"$f":"Population!AT12/Population!AT$23","v":0},{"$f":"Population!AU12/Population!AU$23","v":0},{"$f":"Population!AV12/Population!AV$23","v":0},{"$f":"Population!AW12/Population!AW$23","v":0},{"$f":"Population!AX12/Population!AX$23","v":0},{"$f":"Population!AY12/Population!AY$23","v":0},{"$f":"Population!AZ12/Population!AZ$23","v":0},{"$f":"Population!BA12/Population!BA$23","v":0},{"$f":"Population!BB12/Population!BB$23","v":0},null,{"$f":"EXP(-r_est*Lifetable!A12)*Lifetable!F12","v":0},0]
[{"$f":"IF(Lifetable!A13 = \"\", \"\", \"X\"&Lifetable!A13)","v":""},{"$f":"Population!B13/Population!B$23","v":0},{"$f":"Population!C13/Population!C$23","v":0},{"$f":"Population!D13/Population!D$23","v":0},{"$f":"Population!E13/Population!E$23","v":0},{"$f":"Population!F13/Population!F$23","v":0},{"$f":"Population!G13/Population!G$23","v":0},{"$f":"Population!H13/Population!H$23","v":0},{"$f":"Population!I13/Population!I$23","v":0},{"$f":"Population!J13/Population!J$23","v":0},{"$f":"Population!K13/Population!K$23","v":0},{"$f":"Population!L13/Population!L$23","v":0},{"$f":"Population!M13/Population!M$23","v":0},{"$f":"Population!N13/Population!N$23","v":0},{"$f":"Population!O13/Population!O$23","v":0},{"$f":"Population!P13/Population!P$23","v":0},{"$f":"Population!Q13/Population!Q$23","v":0},{"$f":"Population!R13/Population!R$23","v":0},{"$f":"Population!S13/Population!S$23","v":0},{"$f":"Population!T13/Population!T$23","v":0},{"$f":"Population!U13/Population!U$23","v":0},{"$f":"Population!V13/Population!V$23","v":0},{"$f":"Population!W13/Population!W$23","v":0},{"$f":"Population!X13/Population!X$23","v":0},{"$f":"Population!Y13/Population!Y$23","v":0},{"$f":"Population!Z13/Population!Z$23","v":0},{"$f":"Population!AA13/Population!AA$23","v":0},{"$f":"Population!AB13/Population!AB$23","v":0},{"$f":"Population!AC13/Population!AC$23","v":0},{"$f":"Population!AD13/Population!AD$23","v":0},{"$f":"Population!AE13/Population!AE$23","v":0},{"$f":"Population!AF13/Population!AF$23","v":0},{"$f":"Population!AG13/Population!AG$23","v":0},{"$f":"Population!AH13/Population!AH$23","v":0},{"$f":"Population!AI13/Population!AI$23","v":0},{"$f":"Population!AJ13/Population!AJ$23","v":0},{"$f":"Population!AK13/Population!AK$23","v":0},{"$f":"Population!AL13/Population!AL$23","v":0},{"$f":"Population!AM13/Population!AM$23","v":0},{"$f":"Population!AN13/Population!AN$23","v":0},{"$f":"Population!AO13/Population!AO$23","v":0},{"$f":"Population!AP13/Population!AP$23","v":0},{"$f":"Population!AQ13/Population!AQ$23","v":0},{"$f":"Population!AR13/Population!AR$23","v":0},{"$f":"Population!AS13/Population!AS$23","v":0},{"$f":"Population!AT13/Population!AT$23","v":0},{"$f":"Population!AU13/Population!AU$23","v":0},{"$f":"Population!AV13/Population!AV$23","v":0},{"$f":"Population!AW13/Population!AW$23","v":0},{"$f":"Population!AX13/Population!AX$23","v":0},{"$f":"Population!AY13/Population!AY$23","v":0},{"$f":"Population!AZ13/Population!AZ$23","v":0},{"$f":"Population!BA13/Population!BA$23","v":0},{"$f":"Population!BB13/Population!BB$23","v":0},null,{"$f":"EXP(-r_est*Lifetable!A13)*Lifetable!F13","v":0},0]
[{"$f":"IF(Lifetable!A14 = \"\", \"\", \"X\"&Lifetable!A14)","v":""},{"$f":"Population!B14/Population!B$23","v":0},{"$f":"Population!C14/Population!C$23","v":0},{"$f":"Population!D14/Population!D$23","v":0},{"$f":"Population!E14/Population!E$23","v":0},{"$f":"Population!F14/Population!F$23","v":0},{"$f":"Population!G14/Population!G$23","v":0},{"$f":"Population!H14/Population!H$23","v":0},{"$f":"Population!I14/Population!I$23","v":0},{"$f":"Population!J14/Population!J$23","v":0},{"$f":"Population!K14/Population!K$23","v":0},{"$f":"Population!L14/Population!L$23","v":0},{"$f":"Population!M14/Population!M$23","v":0},{"$f":"Population!N14/Population!N$23","v":0},{"$f":"Population!O14/Population!O$23","v":0},{"$f":"Population!P14/Population!P$23","v":0},{"$f":"Population!Q14/Population!Q$23","v":0},{"$f":"Population!R14/Population!R$23","v":0},{"$f":"Population!S14/Population!S$23","v":0},{"$f":"Population!T14/Population!T$23","v":0},{"$f":"Population!U14/Population!U$23","v":0},{"$f":"Population!V14/Population!V$23","v":0},{"$f":"Population!W14/Population!W$23","v":0},{"$f":"Population!X14/Population!X$23","v":0},{"$f":"Population!Y14/Population!Y$23","v":0},{"$f":"Population!Z14/Population!Z$23","v":0},{"$f":"Population!AA14/Population!AA$23","v":0},{"$f":"Population!AB14/Population!AB$23","v":0},{"$f":"Population!AC14/Population!AC$23","v":0},{"$f":"Population!AD14/Population!AD$23","v":0},{"$f":"Population!AE14/Population!AE$23","v":0},{"$f":"Population!AF14/Population!AF$23","v":0},{"$f":"Population!AG14/Population!AG$23","v":0},{"$f":"Population!AH14/Population!AH$23","v":0},{"$f":"Population!AI14/Population!AI$23","v":0},{"$f":"Population!AJ14/Population!AJ$23","v":0},{"$f":"Population!AK14/Population!AK$23","v":0},{"$f":"Population!AL14/Population!AL$23","v":0},{"$f":"Population!AM14/Population!AM$23","v":0},{"$f":"Population!AN14/Population!AN$23","v":0},{"$f":"Population!AO14/Population!AO$23","v":0},{"$f":"Population!AP14/Population!AP$23","v":0},{"$f":"Population!AQ14/Population!AQ$23","v":0},{"$f":"Population!AR14/Population!AR$23","v":0},{"$f":"Population!AS14/Population!AS$23","v":0},{"$f":"Population!AT14/Population!AT$23","v":0},{"$f":"Population!AU14/Population!AU$23","v":0},{"$f":"Population!AV14/Population!AV$23","v":0},{"$f":"Population!AW14/Population!AW$23","v":0},{"$f":"Population!AX14/Population!AX$23","v":0},{"$f":"Population!AY14/Population!AY$23","v":0},{"$f":"Population!AZ14/Population!AZ$23","v":0},{"$f":"Population!BA14/Population!BA$23","v":0},{"$f":"Population!BB14/Population!BB$23","v":0},null,{"$f":"EXP(-r_est*Lifetable!A14)*Lifetable!F14","v":0},{"$f":"BD14/BD$23","v":0}]
[{"$f":"IF(Lifetable!A15 = \"\", \"\", \"X\"&Lifetable!A15)","v":""},{"$f":"Population!B15/Population!B$23","v":0},{"$f":"Population!C15/Population!C$23","v":0},{"$f":"Population!D15/Population!D$23","v":0},{"$f":"Population!E15/Population!E$23","v":0},{"$f":"Population!F15/Population!F$23","v":0},{"$f":"Population!G15/Population!G$23","v":0},{"$f":"Population!H15/Population!H$23","v":0},{"$f":"Population!I15/Population!I$23","v":0},{"$f":"Population!J15/Population!J$23","v":0},{"$f":"Population!K15/Population!K$23","v":0},{"$f":"Population!L15/Population!L$23","v":0},{"$f":"Population!M15/Population!M$23","v":0},{"$f":"Population!N15/Population!N$23","v":0},{"$f":"Population!O15/Population!O$23","v":0},{"$f":"Population!P15/Population!P$23","v":0},{"$f":"Population!Q15/Population!Q$23","v":0},{"$f":"Population!R15/Population!R$23","v":0},{"$f":"Population!S15/Population!S$23","v":0},{"$f":"Population!T15/Population!T$23","v":0},{"$f":"Population!U15/Population!U$23","v":0},{"$f":"Population!V15/Population!V$23","v":0},{"$f":"Population!W15/Population!W$23","v":0},{"$f":"Population!X15/Population!X$23","v":0},{"$f":"Population!Y15/Population!Y$23","v":0},{"$f":"Population!Z15/Population!Z$23","v":0},{"$f":"Population!AA15/Population!AA$23","v":0},{"$f":"Population!AB15/Population!AB$23","v":0},{"$f":"Population!AC15/Population!AC$23","v":0},{"$f":"Population!AD15/Population!AD$23","v":0},{"$f":"Population!AE15/Population!AE$23","v":0},{"$f":"Population!AF15/Population!AF$23","v":0},{"$f":"Population!AG15/Population!AG$23","v":0},{"$f":"Population!AH15/Population!AH$23","v":0},{"$f":"Population!AI15/Population!AI$23","v":0},{"$f":"Population!AJ15/Population!AJ$23","v":0},{"$f":"Population!AK15/Population!AK$23","v":0},{"$f":"Population!AL15/Population!AL$23","v":0},{"$f":"Population!AM15/Population!AM$23","v":0},{"$f":"Population!AN15/Population!AN$23","v":0},{"$f":"Population!AO15/Population!AO$23","v":0},{"$f":"Population!AP15/Population!AP$23","v":0},{"$f":"Population!AQ15/Population!AQ$23","v":0},{"$f":"Population!AR15/Population!AR$23","v":0},{"$f":"Population!AS15/Population!AS$23","v":0},{"$f":"Population!AT15/Population!AT$23","v":0},{"$f":"Population!AU15/Population!AU$23","v":0},{"$f":"Population!AV15/Population!AV$23","v":0},{"$f":"Population!AW15/Population!AW$23","v":0},{"$f":"Population!AX15/Population!AX$23","v":0},{"$f":"Population!AY15/Population!AY$23","v":0},{"$f":"Population!AZ15/Population!AZ$23","v":0},{"$f":"Population!BA15/Population!BA$23","v":0},{"$f":"Population!BB15/Population!BB$23","v":0},null,{"$f":"EXP(-r_est*Lifetable!A15)*Lifetable!F15","v":0},0]
[{"$f":"IF(Lifetable!A16 = \"\", \"\", \"X\"&Lifetable!A16)","v":""},{"$f":"Population!B16/Population!B$23","v":0},{"$f":"Population!C16/Population!C$23","v":0},{"$f":"Population!D16/Population!D$23","v":0},{"$f":"Population!E16/Population!E$23","v":0},{"$f":"Population!F16/Population!F$23","v":0},{"$f":"Population!G16/Population!G$23","v":0},{"$f":"Population!H16/Population!H$23","v":0},{"$f":"Population!I16/Population!I$23","v":0},{"$f":"Population!J16/Population!J$23","v":0},{"$f":"Population!K16/Population!K$23","v":0},{"$f":"Population!L16/Population!L$23","v":0},{"$f":"Population!M16/Population!M$23","v":0},{"$f":"Population!N16/Population!N$23","v":0},{"$f":"Population!O16/Population!O$23","v":0},{"$f":"Population!P16/Population!P$23","v":0},{"$f":"Population!Q16/Population!Q$23","v":0},{"$f":"Population!R16/Population!R$23","v":0},{"$f":"Population!S16/Population!S$23","v":0},{"$f":"Population!T16/Population!T$23","v":0},{"$f":"Population!U16/Population!U$23","v":0},{"$f":"Population!V16/Population!V$23","v":0},{"$f":"Population!W16/Population!W$23","v":0},{"$f":"Population!X16/Population!X$23","v":0},{"$f":"Population!Y16/Population!Y$23","v":0},{"$f":"Population!Z16/Population!Z$23","v":0},{"$f":"Population!AA16/Population!AA$23","v":0},{"$f":"Population!AB16/Population!AB$23","v":0},{"$f":"Population!AC16/Population!AC$23","v":0},{"$f":"Population!AD16/Population!AD$23","v":0},{"$f":"Population!AE16/Population!AE$23","v":0},{"$f":"Population!AF16/Population!AF$23","v":0},{"$f":"Population!AG16/Population!AG$23","v":0},{"$f":"Population!AH16/Population!AH$23","v":0},{"$f":"Population!AI16/Population!AI$23","v":0},{"$f":"Population!AJ16/Population!AJ$23","v":0},{"$f":"Population!AK16/Population!AK$23","v":0},{"$f":"Population!AL16/Population!AL$23","v":0},{"$f":"Population!AM16/Population!AM$23","v":0},{"$f":"Population!AN16/Population!AN$23","v":0},{"$f":"Population!AO16/Population!AO$23","v":0},{"$f":"Population!AP16/Population!AP$23","v":0},{"$f":"Population!AQ16/Population!AQ$23","v":0},{"$f":"Population!AR16/Population!AR$23","v":0},{"$f":"Population!AS16/Population!AS$23","v":0},{"$f":"Population!AT16/Population!AT$23","v":0},{"$f":"Population!AU16/Population!AU$23","v":0},{"$f":"Population!AV16/Population!AV$23","v":0},{"$f":"Population!AW16/Population!AW$23","v":0},{"$f":"Population!AX16/Population!AX$23","v":0},{"$f":"Population!AY16/Population!AY$23","v":0},{"$f":"Population!AZ16/Population!AZ$23","v":0},{"$f":"Population!BA16/Population!BA$23","v":0},{"$f":"Population!BB16/Population!BB$23","v":0},null,{"$f":"EXP(-r_est*Lifetable!A16)*Lifetable!F16","v":0},0]
[{"$f":"IF(Lifetable!A17 = \"\", \"\", \"X\"&Lifetable!A17)","v":""},{"$f":"Population!B17/Population!B$23","v":0},{"$f":"Population!C17/Population!C$23","v":0},{"$f":"Population!D17/Population!D$23","v":0},{"$f":"Population!E17/Population!E$23","v":0},{"$f":"Population!F17/Population!F$23","v":0},{"$f":"Population!G17/Population!G$23","v":0},{"$f":"Population!H17/Population!H$23","v":0},{"$f":"Population!I17/Population!I$23","v":0},{"$f":"Population!J17/Population!J$23","v":0},{"$f":"Population!K17/Population!K$23","v":0},{"$f":"Population!L17/Population!L$23","v":0},{"$f":"Population!M17/Population!M$23","v":0},{"$f":"Population!N17/Population!N$23","v":0},{"$f":"Population!O17/Population!O$23","v":0},{"$f":"Population!P17/Population!P$23","v":0},{"$f":"Population!Q17/Population!Q$23","v":0},{"$f":"Population!R17/Population!R$23","v":0},{"$f":"Population!S17/Population!S$23","v":0},{"$f":"Population!T17/Population!T$23","v":0},{"$f":"Population!U17/Population!U$23","v":0},{"$f":"Population!V17/Population!V$23","v":0},{"$f":"Population!W17/Population!W$23","v":0},{"$f":"Population!X17/Population!X$23","v":0},{"$f":"Population!Y17/Population!Y$23","v":0},{"$f":"Population!Z17/Population!Z$23","v":0},{"$f":"Population!AA17/Population!AA$23","v":0},{"$f":"Population!AB17/Population!AB$23","v":0},{"$f":"Population!AC17/Population!AC$23","v":0},{"$f":"Population!AD17/Population!AD$23","v":0},{"$f":"Population!AE17/Population!AE$23","v":0},{"$f":"Population!AF17/Population!AF$23","v":0},{"$f":"Population!AG17/Population!AG$23","v":0},{"$f":"Population!AH17/Population!AH$23","v":0},{"$f":"Population!AI17/Population!AI$23","v":0},{"$f":"Population!AJ17/Population!AJ$23","v":0},{"$f":"Population!AK17/Population!AK$23","v":0},{"$f":"Population!AL17/Population!AL$23","v":0},{"$f":"Population!AM17/Population!AM$23","v":0},{"$f":"Population!AN17/Population!AN$23","v":0},{"$f":"Population!AO17/Population!AO$23","v":0},{"$f":"Population!AP17/Population!AP$23","v":0},{"$f":"Population!AQ17/Population!AQ$23","v":0},{"$f":"Population!AR17/Population!AR$23","v":0},{"$f":"Population!AS17/Population!AS$23","v":0},{"$f":"Population!AT17/Population!AT$23","v":0},{"$f":"Population!AU17/Population!AU$23","v":0},{"$f":"Population!AV17/Population!AV$23","v":0},{"$f":"Population!AW17/Population!AW$23","v":0},{"$f":"Population!AX17/Population!AX$23","v":0},{"$f":"Population!AY17/Population!AY$23","v":0},{"$f":"Population!AZ17/Population!AZ$23","v":0},{"$f":"Population!BA17/Population!BA$23","v":0},{"$f":"Population!BB17/Population!BB$23","v":0},null,{"$f":"EXP(-r_est*Lifetable!A17)*Lifetable!F17","v":0},0]
[{"$f":"IF(Lifetable!A18 = \"\", \"\", \"X\"&Lifetable!A18)","v":""},{"$f":"Population!B18/Population!B$23","v":0},{"$f":"Population!C18/Population!C$23","v":0},{"$f":"Population!D18/Population!D$23","v":0},{"$f":"Population!E18/Population!E$23","v":0},{"$f":"Population!F18/Population!F$23","v":0},{"$f":"Population!G18/Population!G$23","v":0},{"$f":"Population!H18/Population!H$23","v":0},{"$f":"Population!I18/Population!I$23","v":0},{"$f":"Population!J18/Population!J$23","v":0},{"$f":"Population!K18/Population!K$23","v":0},{"$f":"Population!L18/Population!L$23","v":0},{"$f":"Population!M18/Population!M$23","v":0},{"$f":"Population!N18/Population!N$23","v":0},{"$f":"Population!O18/Population!O$23","v":0},{"$f":"Population!P18/Population!P$23","v":0},{"$f":"Population!Q18/Population!Q$23","v":0},{"$f":"Population!R18/Population!R$23","v":0},{"$f":"Population!S18/Population!S$23","v":0},{"$f":"Population!T18/Population!T$23","v":0},{"$f":"Population!U18/Population!U$23","v":0},{"$f":"Population!V18/Population!V$23","v":0},{"$f":"Population!W18/Population!W$23","v":0},{"$f":"Population!X18/Population!X$23","v":0},{"$f":"Population!Y18/Population!Y$23","v":0},{"$f":"Population!Z18/Population!Z$23","v":0},{"$f":"Population!AA18/Population!AA$23","v":0},{"$f":"Population!AB18/Population!AB$23","v":0},{"$f":"Population!AC18/Population!AC$23","v":0},{"$f":"Population!AD18/Population!AD$23","v":0},{"$f":"Population!AE18/Population!AE$23","v":0},{"$f":"Population!AF18/Population!AF$23","v":0},{"$f":"Population!AG18/Population!AG$23","v":0},{"$f":"Population!AH18/Population!AH$23","v":0},{"$f":"Population!AI18/Population!AI$23","v":0},{"$f":"Population!AJ18/Population!AJ$23","v":0},{"$f":"Population!AK18/Population!AK$23","v":0},{"$f":"Population!AL18/Population!AL$23","v":0},{"$f":"Population!AM18/Population!AM$23","v":0},{"$f":"Population!AN18/Population!AN$23","v":0},{"$f":"Population!AO18/Population!AO$23","v":0},{"$f":"Population!AP18/Population!AP$23","v":0},{"$f":"Population!AQ18/Population!AQ$23","v":0},{"$f":"Population!AR18/Population!AR$23","v":0},{"$f":"Population!AS18/Population!AS$23","v":0},{"$f":"Population!AT18/Population!AT$23","v":0},{"$f":"Population!AU18/Population!AU$23","v":0},{"$f":"Population!AV18/Population!AV$23","v":0},{"$f":"Population!AW18/Population!AW$23","v":0},{"$f":"Population!AX18/Population!AX$23","v":0},{"$f":"Population!AY18/Population!AY$23","v":0},{"$f":"Population!AZ18/Population!AZ$23","v":0},{"$f":"Population!BA18/Population!BA$23","v":0},{"$f":"Population!BB18/Population!BB$23","v":0},null,{"$f":"EXP(-r_est*Lifetable!A18)*Lifetable!F18","v":0},0]
[{"$f":"IF(Lifetable!A19 = \"\", \"\", \"X\"&Lifetable!A19)","v":""},{"$f":"Population!B19/Population!B$23","v":0},{"$f":"Population!C19/Population!C$23","v":0},{"$f":"Population!D19/Population!D$23","v":0},{"$f":"Population!E19/Population!E$23","v":0},{"$f":"Population!F19/Population!F$23","v":0},{"$f":"Population!G19/Population!G$23","v":0},{"$f":"Population!H19/Population!H$23","v":0},{"$f":"Population!I19/Population!I$23","v":0},{"$f":"Population!J19/Population!J$23","v":0},{"$f":"Population!K19/Population!K$23","v":0},{"$f":"Population!L19/Population!L$23","v":0},{"$f":"Population!M19/Population!M$23","v":0},{"$f":"Population!N19/Population!N$23","v":0},{"$f":"Population!O19/Population!O$23","v":0},{"$f":"Population!P19/Population!P$23","v":0},{"$f":"Population!Q19/Population!Q$23","v":0},{"$f":"Population!R19/Population!R$23","v":0},{"$f":"Population!S19/Population!S$23","v":0},{"$f":"Population!T19/Population!T$23","v":0},{"$f":"Population!U19/Population!U$23","v":0},{"$f":"Population!V19/Population!V$23","v":0},{"$f":"Population!W19/Population!W$23","v":0},{"$f":"Population!X19/Population!X$23","v":0},{"$f":"Population!Y19/Population!Y$23","v":0},{"$f":"Population!Z19/Population!Z$23","v":0},{"$f":"Population!AA19/Population!AA$23","v":0},{"$f":"Population!AB19/Population!AB$23","v":0},{"$f":"Population!AC19/Population!AC$23","v":0},{"$f":"Population!AD19/Population!AD$23","v":0},{"$f":"Population!AE19/Population!AE$23","v":0},{"$f":"Population!AF19/Population!AF$23","v":0},{"$f":"Population!AG19/Population!AG$23","v":0},{"$f":"Population!AH19/Population!AH$23","v":0},{"$f":"Population!AI19/Population!AI$23","v":0},{"$f":"Population!AJ19/Population!AJ$23","v":0},{"$f":"Population!AK19/Population!AK$23","v":0},{"$f":"Population!AL19/Population!AL$23","v":0},{"$f":"Population!AM19/Population!AM$23","v":0},{"$f":"Population!AN19/Population!AN$23","v":0},{"$f":"Population!AO19/Population!AO$23","v":0},{"$f":"Population!AP19/Population!AP$23","v":0},{"$f":"Population!AQ19/Population!AQ$23","v":0},{"$f":"Population!AR19/Population!AR$23","v":0},{"$f":"Population!AS19/Population!AS$23","v":0},{"$f":"Population!AT19/Population!AT$23","v":0},{"$f":"Population!AU19/Population!AU$23","v":0},{"$f":"Population!AV19/Population!AV$23","v":0},{"$f":"Population!AW19/Population!AW$23","v":0},{"$f":"Population!AX19/Population!AX$23","v":0},{"$f":"Population!AY19/Population!AY$23","v":0},{"$f":"Population!AZ19/Population!AZ$23","v":0},{"$f":"Population!BA19/Population!BA$23","v":0},{"$f":"Population!BB19/Population!BB$23","v":0},null,{"$f":"EXP(-r_est*Lifetable!A19)*Lifetable!F19","v":0},0]
[{"$f":"IF(Lifetable!A20 = \"\", \"\", \"X\"&Lifetable!A20)","v":""},{"$f":"Population!B20/Population!B$23","v":0},{"$f":"Population!C20/Population!C$23","v":0},{"$f":"Population!D20/Population!D$23","v":0},{"$f":"Population!E20/Population!E$23","v":0},{"$f":"Population!F20/Population!F$23","v":0},{"$f":"Population!G20/Population!G$23","v":0},{"$f":"Population!H20/Population!H$23","v":0},{"$f":"Population!I20/Population!I$23","v":0},{"$f":"Population!J20/Population!J$23","v":0},{"$f":"Population!K20/Population!K$23","v":0},{"$f":"Population!L20/Population!L$23","v":0},{"$f":"Population!M20/Population!M$23","v":0},{"$f":"Population!N20/Population!N$23","v":0},{"$f":"Population!O20/Population!O$23","v":0},{"$f":"Population!P20/Population!P$23","v":0},{"$f":"Population!Q20/Population!Q$23","v":0},{"$f":"Population!R20/Population!R$23","v":0},{"$f":"Population!S20/Population!S$23","v":0},{"$f":"Population!T20/Population!T$23","v":0},{"$f":"Population!U20/Population!U$23","v":0},{"$f":"Population!V20/Population!V$23","v":0},{"$f":"Population!W20/Population!W$23","v":0},{"$f":"Population!X20/Population!X$23","v":0},{"$f":"Population!Y20/Population!Y$23","v":0},{"$f":"Population!Z20/Population!Z$23","v":0},{"$f":"Population!AA20/Population!AA$23","v":0},{"$f":"Population!AB20/Population!AB$23","v":0},{"$f":"Population!AC20/Population!AC$23","v":0},{"$f":"Population!AD20/Population!AD$23","v":0},{"$f":"Population!AE20/Population!AE$23","v":0},{"$f":"Population!AF20/Population!AF$23","v":0},{"$f":"Population!AG20/Population!AG$23","v":0},{"$f":"Population!AH20/Population!AH$23","v":0},{"$f":"Population!AI20/Population!AI$23","v":0},{"$f":"Population!AJ20/Population!AJ$23","v":0},{"$f":"Population!AK20/Population!AK$23","v":0},{"$f":"Population!AL20/Population!AL$23","v":0},{"$f":"Population!AM20/Population!AM$23","v":0},{"$f":"Population!AN20/Population!AN$23","v":0},{"$f":"Population!AO20/Population!AO$23","v":0},{"$f":"Population!AP20/Population!AP$23","v":0},{"$f":"Population!AQ20/Population!AQ$23","v":0},{"$f":"Population!AR20/Population!AR$23","v":0},{"$f":"Population!AS20/Population!AS$23","v":0},{"$f":"Population!AT20/Population!AT$23","v":0},{"$f":"Population!AU20/Population!AU$23","v":0},{"$f":"Population!AV20/Population!AV$23","v":0},{"$f":"Population!AW20/Population!AW$23","v":0},{"$f":"Population!AX20/Population!AX$23","v":0},{"$f":"Population!AY20/Population!AY$23","v":0},{"$f":"Population!AZ20/Population!AZ$23","v":0},{"$f":"Population!BA20/Population!BA$23","v":0},{"$f":"Population!BB20/Population!BB$23","v":0},null,{"$f":"EXP(-r_est*Lifetable!A20)*Lifetable!F20","v":0},0]
[{"$f":"IF(Lifetable!A21 = \"\", \"\", \"X\"&Lifetable!A21)","v":""},{"$f":"Population!B21/Population!B$23","v":0},{"$f":"Population!C21/Population!C$23","v":0},{"$f":"Population!D21/Population!D$23","v":0},{"$f":"Population!E21/Population!E$23","v":0},{"$f":"Population!F21/Population!F$23","v":0},{"$f":"Population!G21/Population!G$23","v":0},{"$f":"Population!H21/Population!H$23","v":0},{"$f":"Population!I21/Population!I$23","v":0},{"$f":"Population!J21/Population!J$23","v":0},{"$f":"Population!K21/Population!K$23","v":0},{"$f":"Population!L21/Population!L$23","v":0},{"$f":"Population!M21/Population!M$23","v":0},{"$f":"Population!N21/Population!N$23","v":0},{"$f":"Population!O21/Population!O$23","v":0},{"$f":"Population!P21/Population!P$23","v":0},{"$f":"Population!Q21/Population!Q$23","v":0},{"$f":"Population!R21/Population!R$23","v":0},{"$f":"Population!S21/Population!S$23","v":0},{"$f":"Population!T21/Population!T$23","v":0},{"$f":"Population!U21/Population!U$23","v":0},{"$f":"Population!V21/Population!V$23","v":0},{"$f":"Population!W21/Population!W$23","v":0},{"$f":"Population!X21/Population!X$23","v":0},{"$f":"Population!Y21/Population!Y$23","v":0},{"$f":"Population!Z21/Population!Z$23","v":0},{"$f":"Population!AA21/Population!AA$23","v":0},{"$f":"Population!AB21/Population!AB$23","v":0},{"$f":"Population!AC21/Population!AC$23","v":0},{"$f":"Population!AD21/Population!AD$23","v":0},{"$f":"Population!AE21/Population!AE$23","v":0},{"$f":"Population!AF21/Population!AF$23","v":0},{"$f":"Population!AG21/Population!AG$23","v":0},{"$f":"Population!AH21/Population!AH$23","v":0},{"$f":"Population!AI21/Population!AI$23","v":0},{"$f":"Population!AJ21/Population!AJ$23","v":0},{"$f":"Population!AK21/Population!AK$23","v":0},{"$f":"Population!AL21/Population!AL$23","v":0},{"$f":"Population!AM21/Population!AM$23","v":0},{"$f":"Population!AN21/Population!AN$23","v":0},{"$f":"Population!AO21/Population!AO$23","v":0},{"$f":"Population!AP21/Population!AP$23","v":0},{"$f":"Population!AQ21/Population!AQ$23","v":0},{"$f":"Population!AR21/Population!AR$23","v":0},{"$f":"Population!AS21/Population!AS$23","v":0},{"$f":"Population!AT21/Population!AT$23","v":0},{"$f":"Population!AU21/Population!AU$23","v":0},{"$f":"Population!AV21/Population!AV$23","v":0},{"$f":"Population!AW21/Population!AW$23","v":0},{"$f":"Population!AX21/Population!AX$23","v":0},{"$f":"Population!AY21/Population!AY$23","v":0},{"$f":"Population!AZ21/Population!AZ$23","v":0},{"$f":"Population!BA21/Population!BA$23","v":0},{"$f":"Population!BB21/Population!BB$23","v":0},null,{"$f":"EXP(-r_est*Lifetable!A21)*Lifetable!F21","v":0},0]
[{"$f":"IF(Lifetable!A22 = \"\", \"\", \"X\"&Lifetable!A22)","v":""},{"$f":"Population!B22/Population!B$23","v":0},{"$f":"Population!C22/Population!C$23","v":0},{"$f":"Population!D22/Population!D$23","v":0},{"$f":"Population!E22/Population!E$23","v":0},{"$f":"Population!F22/Population!F$23","v":0},{"$f":"Population!G22/Population!G$23","v":0},{"$f":"Population!H22/Population!H$23","v":0},{"$f":"Population!I22/Population!I$23","v":0},{"$f":"Population!J22/Population!J$23","v":0},{"$f":"Population!K22/Population!K$23","v":0},{"$f":"Population!L22/Population!L$23","v":0},{"$f":"Population!M22/Population!M$23","v":0},{"$f":"Population!N22/Population!N$23","v":0},{"$f":"Population!O22/Population!O$23","v":0},{"$f":"Population!P22/Population!P$23","v":0},{"$f":"Population!Q22/Population!Q$23","v":0},{"$f":"Population!R22/Population!R$23","v":0},{"$f":"Population!S22/Population!S$23","v":0},{"$f":"Population!T22/Population!T$23","v":0},{"$f":"Population!U22/Population!U$23","v":0},{"$f":"Population!V22/Population!V$23","v":0},{"$f":"Population!W22/Population!W$23","v":0},{"$f":"Population!X22/Population!X$23","v":0},{"$f":"Population!Y22/Population!Y$23","v":0},{"$f":"Population!Z22/Population!Z$23","v":0},{"$f":"Population!AA22/Population!AA$23","v":0},{"$f":"Population!AB22/Population!AB$23","v":0},{"$f":"Population!AC22/Population!AC$23","v":0},{"$f":"Population!AD22/Population!AD$23","v":0},{"$f":"Population!AE22/Population!AE$23","v":0},{"$f":"Population!AF22/Population!AF$23","v":0},{"$f":"Population!AG22/Population!AG$23","v":0},{"$f":"Population!AH22/Population!AH$23","v":0},{"$f":"Population!AI22/Population!AI$23","v":0},{"$f":"Population!AJ22/Population!AJ$23","v":0},{"$f":"Population!AK22/Population!AK$23","v":0},{"$f":"Population!AL22/Population!AL$23","v":0},{"$f":"Population!AM22/Population!AM$23","v":0},{"$f":"Population!AN22/Population!AN$23","v":0},{"$f":"Population!AO22/Population!AO$23","v":0},{"$f":"Population!AP22/Population!AP$23","v":0},{"$f":"Population!AQ22/Population!AQ$23","v":0},{"$f":"Population!AR22/Population!AR$23","v":0},{"$f":"Population!AS22/Population!AS$23","v":0},{"$f":"Population!AT22/Population!AT$23","v":0},{"$f":"Population!AU22/Population!AU$23","v":0},{"$f":"Population!AV22/Population!AV$23","v":0},{"$f":"Population!AW22/Population!AW$23","v":0},{"$f":"Population!AX22/Population!AX$23","v":0},{"$f":"Population!AY22/Population!AY$23","v":0},{"$f":"Population!AZ22/Population!AZ$23","v":0},{"$f":"Population!BA22/Population!BA$23","v":0},{"$f":"Population!BB22/Population!BB$23","v":0},null,{"$f":"EXP(-r_est*Lifetable!A22)*Lifetable!F22","v":0},0]
[null,null,null,null,null,null,null,null,null,null,null,null,null,null,null,null,null,null,null,null,null,null,null,null,null,null,null,null,null,null,null,null,null,null,null,null,null,null,null,null,null,null,null,null,null,null,null,null,null,null,null,null,null,null,null,{"$f":"SUM(BD2:BD17)","v":2.4448066832832391}]
[]
[]
[]
[]
[]
[]
[]
[]
[]
[]
[]
[]
[]
[]
[]
[]
[null,"Adjust the data range of the graphs (if needed)!\n(Click on the graph and adjust the range of the X column)"]

{"sheet":"RV","index":3,"n_rows":25,"n_cols":9,"rows_kept":25,"cut":false,"hidden":false,"merged":[[24,0,24,8]]}
["X",null,null,null,"vA",null,"mA","RRV","mA/RRV"]
[{"$f":"IF(Lifetable!A2 = \"\", \"\", VALUE(Lifetable!A2))","v":0},{"$f":"EXP(r_est*(A2-1))/Lifetable!F2","v":0.80229747009457242},{"$f":"EXP(-r_est*A2)*Lifetable!H2","v":0},{"$f":"SUM(INDIRECT(ADDRESS(MATCH(A2, A$1:A$22),3,4)&\":\"&ADDRESS(MATCH(omega, A$1:A$22),3,4)))","v":1.0215600493211474},{"$f":"IFERROR(B2*D2, \"\")","v":0.81959504312004317},null,{"$f":"EXP(-r_est)*Lifetable!G2","v":0},{"$f":"Lifetable!E2*EXP(-r_est)*E3","v":0.81959504312004305},{"$f":"G2/H2","v":0}]
[{"$f":"IF(Lifetable!A3 = \"\", \"\", VALUE(Lifetable!A3))","v":1},{"$f":"EXP(r_est*(A3-1))/Lifetable!F3","v":1.3333333333333333},{"$f":"EXP(-r_est*A3)*Lifetable!H3","v":0},1.0215600493211474,{"$f":"B3*D3","v":1.3620800657615297},null,{"$f":"EXP(-r_est)*Lifetable!G3","v":0},{"$f":"Lifetable!E3*EXP(-r_est)*E4","v":1.3620800657615295},{"$f":"G3/H3","v":0}]
[{"$f":"IF(Lifetable!A4 = \"\", \"\", VALUE(Lifetable!A4))","v":2},{"$f":"EXP(r_est*(A4-1))/Lifetable!F4","v":2.0773674712824466},{"$f":"EXP(-r_est*A4)*Lifetable!H4","v":0.46345048597450905},1.0215600493211474,{"$f":"B4*D4","v":2.1221556164214435},null,{"$f":"EXP(-r_est)*Lifetable!G4","v":0.96275696411348688},{"$f":"Lifetable!E4*EXP(-r_est)*E5","v":1.1593986523079567},0.83039337866830787]
[{"$f":"IF(Lifetable!A5 = \"\", \"\", VALUE(Lifetable!A5))","v":3},{"$f":"EXP(r_est*(A5-1))/Lifetable!F5","v":3.2365917080568209},{"$f":"EXP(-r_est*A5)*Lifetable!H5","v":0.34703680891735211},0.5581095633466383,1.8063727849149427,null,{"$f":"EXP(-r_est)*Lifetable!G5","v":1.1232164581324013},{"$f":"Lifetable!E5*EXP(-r_est)*E6","v":0.68315632678254135},1.6441572947474694]
[{"$f":"IF(Lifetable!A6 = \"\", \"\", VALUE(Lifetable!A6))","v":4},{"$f":"EXP(r_est*(A6-1))/Lifetable!F6","v":5.3788722657117871},{"$f":"EXP(-r_est*A6)*Lifetable!H6","v":0.15363190523507561},0.21107275442928619,1.1353333848470823,null,{"$f":"EXP(-r_est)*Lifetable!G6","v":0.82636639419740965},{"$f":"Lifetable!E6*EXP(-r_est)*E7","v":0.30896699064967265},2.6746106192761507]
[{"$f":"IF(Lifetable!A7 = \"\", \"\", VALUE(Lifetable!A7))","v":5},{"$f":"EXP(r_est*(A7-1))/Lifetable!F7","v":13.408673132367579},{"$f":"EXP(-r_est*A7)*Lifetable!H7","v":5.7440849194210594E-2},5.7440849194210594E-2,0.77020557129078948,null,{"$f":"EXP(-r_est)*Lifetable!G7","v":0.77020557129078948},{"$f":"Lifetable!E7*EXP(-r_est)*E8","v":{"$error":"#VALUE!"}},{"$error":"#VALUE!"}]
[{"$f":"IF(Lifetable!A8 = \"\", \"\", VALUE(Lifetable!A8))","v":""},{"$f":"EXP(r_est*(A8-1))/Lifetable!F8","v":{"$error":"#VALUE!"}},{"$f":"EXP(-r_est*A8)*Lifetable!H8","v":{"$error":"#VALUE!"}},{"$error":"#VALUE!"},{"$error":"#VALUE!"},null,{"$f":"EXP(-r_est)*Lifetable!G8","v":0},{"$f":"Lifetable!E8*EXP(-r_est)*E9","v":{"$error":"#VALUE!"}},{"$error":"#VALUE!"}]
[{"$f":"IF(Lifetable!A9 = \"\", \"\", VALUE(Lifetable!A9))","v":""},{"$f":"EXP(r_est*(A9-1))/Lifetable!F9","v":{"$error":"#VALUE!"}},{"$f":"EXP(-r_est*A9)*Lifetable!H9","v":{"$error":"#VALUE!"}},{"$error":"#VALUE!"},{"$error":"#VALUE!"},null,{"$f":"EXP(-r_est)*Lifetable!G9","v":0},{"$f":"Lifetable!E9*EXP(-r_est)*E10","v":{"$error":"#VALUE!"}},{"$error":"#VALUE!"}]
[{"$f":"IF(Lifetable!A10 = \"\", \"\", VALUE(Lifetable!A10))","v":""},{"$f":"EXP(r_est*(A10-1))/Lifetable!F10","v":{"$error":"#VALUE!"}},{"$f":"EXP(-r_est*A10)*Lifetable!H10","v":{"$error":"#VALUE!"}},{"$error":"#VALUE!"},{"$error":"#VALUE!"},null,{"$f":"EXP(-r_est)*Lifetable!G10","v":0},{"$f":"Lifetable!E10*EXP(-r_est)*E11","v":{"$error":"#VALUE!"}},{"$error":"#VALUE!"}]
[{"$f":"IF(Lifetable!A11 = \"\", \"\", VALUE(Lifetable!A11))","v":""},{"$f":"EXP(r_est*(A11-1))/Lifetable!F11","v":{"$error":"#VALUE!"}},{"$f":"EXP(-r_est*A11)*Lifetable!H11","v":{"$error":"#VALUE!"}},{"$error":"#VALUE!"},{"$error":"#VALUE!"},null,{"$f":"EXP(-r_est)*Lifetable!G11","v":0},{"$f":"Lifetable!E11*EXP(-r_est)*E12","v":{"$error":"#VALUE!"}},{"$error":"#VALUE!"}]
[{"$f":"IF(Lifetable!A12 = \"\", \"\", VALUE(Lifetable!A12))","v":""},{"$f":"EXP(r_est*(A12-1))/Lifetable!F12","v":{"$error":"#VALUE!"}},{"$f":"EXP(-r_est*A12)*Lifetable!H12","v":{"$error":"#VALUE!"}},{"$error":"#VALUE!"},{"$error":"#VALUE!"},null,{"$f":"EXP(-r_est)*Lifetable!G12","v":0},{"$f":"Lifetable!E12*EXP(-r_est)*E13","v":{"$error":"#VALUE!"}},{"$error":"#VALUE!"}]
[{"$f":"IF(Lifetable!A13 = \"\", \"\", VALUE(Lifetable!A13))","v":""},{"$f":"EXP(r_est*(A13-1))/Lifetable!F13","v":{"$error":"#VALUE!"}},{"$f":"EXP(-r_est*A13)*Lifetable!H13","v":{"$error":"#VALUE!"}},{"$error":"#VALUE!"},{"$error":"#VALUE!"},null,{"$f":"EXP(-r_est)*Lifetable!G13","v":0},{"$f":"Lifetable!E13*EXP(-r_est)*E14","v":{"$error":"#VALUE!"}},{"$error":"#VALUE!"}]
[{"$f":"IF(Lifetable!A14 = \"\", \"\", VALUE(Lifetable!A14))","v":""},{"$f":"EXP(r_est*(A14-1))/Lifetable!F14","v":{"$error":"#VALUE!"}},{"$f":"EXP(-r_est*A14)*Lifetable!H14","v":{"$error":"#VALUE!"}},{"$error":"#VALUE!"},{"$error":"#VALUE!"},null,{"$f":"EXP(-r_est)*Lifetable!G14","v":0},{"$f":"Lifetable!E14*EXP(-r_est)*E15","v":{"$error":"#VALUE!"}},{"$error":"#VALUE!"}]
[{"$f":"IF(Lifetable!A15 = \"\", \"\", VALUE(Lifetable!A15))","v":""},{"$f":"EXP(r_est*(A15-1))/Lifetable!F15","v":{"$error":"#VALUE!"}},{"$f":"EXP(-r_est*A15)*Lifetable!H15","v":{"$error":"#VALUE!"}},{"$error":"#VALUE!"},{"$error":"#VALUE!"},null,{"$f":"EXP(-r_est)*Lifetable!G15","v":0},{"$f":"Lifetable!E15*EXP(-r_est)*E16","v":{"$error":"#VALUE!"}},{"$error":"#VALUE!"}]
[{"$f":"IF(Lifetable!A16 = \"\", \"\", VALUE(Lifetable!A16))","v":""},{"$f":"EXP(r_est*(A16-1))/Lifetable!F16","v":{"$error":"#VALUE!"}},{"$f":"EXP(-r_est*A16)*Lifetable!H16","v":{"$error":"#VALUE!"}},{"$error":"#VALUE!"},{"$error":"#VALUE!"},null,{"$f":"EXP(-r_est)*Lifetable!G16","v":0},{"$f":"Lifetable!E16*EXP(-r_est)*E17","v":{"$error":"#VALUE!"}},{"$f":"G16/H16","v":{"$error":"#VALUE!"}}]
[{"$f":"IF(Lifetable!A17 = \"\", \"\", VALUE(Lifetable!A17))","v":""},{"$f":"EXP(r_est*(A17-1))/Lifetable!F17","v":{"$error":"#VALUE!"}},{"$f":"EXP(-r_est*A17)*Lifetable!H17","v":{"$error":"#VALUE!"}},{"$error":"#VALUE!"},{"$error":"#VALUE!"},null,{"$f":"EXP(-r_est)*Lifetable!G17","v":0},{"$f":"Lifetable!E17*EXP(-r_est)*E18","v":{"$error":"#VALUE!"}},{"$error":"#VALUE!"}]
[{"$f":"IF(Lifetable!A18 = \"\", \"\", VALUE(Lifetable!A18))","v":""},{"$f":"EXP(r_est*(A18-1))/Lifetable!F18","v":{"$error":"#VALUE!"}},{"$f":"EXP(-r_est*A18)*Lifetable!H18","v":{"$error":"#VALUE!"}},{"$error":"#VALUE!"},{"$error":"#VALUE!"},null,{"$f":"EXP(-r_est)*Lifetable!G18","v":0},{"$f":"Lifetable!E18*EXP(-r_est)*E19","v":{"$error":"#VALUE!"}},{"$error":"#VALUE!"}]
[{"$f":"IF(Lifetable!A19 = \"\", \"\", VALUE(Lifetable!A19))","v":""},{"$f":"EXP(r_est*(A19-1))/Lifetable!F19","v":{"$error":"#VALUE!"}},{"$f":"EXP(-r_est*A19)*Lifetable!H19","v":{"$error":"#VALUE!"}},{"$error":"#VALUE!"},{"$error":"#VALUE!"},null,{"$f":"EXP(-r_est)*Lifetable!G19","v":0},{"$f":"Lifetable!E19*EXP(-r_est)*E20","v":{"$error":"#VALUE!"}},{"$error":"#VALUE!"}]
[{"$f":"IF(Lifetable!A20 = \"\", \"\", VALUE(Lifetable!A20))","v":""},{"$f":"EXP(r_est*(A20-1))/Lifetable!F20","v":{"$error":"#VALUE!"}},{"$f":"EXP(-r_est*A20)*Lifetable!H20","v":{"$error":"#VALUE!"}},{"$error":"#VALUE!"},{"$error":"#VALUE!"},null,{"$f":"EXP(-r_est)*Lifetable!G20","v":0},{"$f":"Lifetable!E20*EXP(-r_est)*E21","v":{"$error":"#VALUE!"}},{"$error":"#VALUE!"}]
[{"$f":"IF(Lifetable!A21 = \"\", \"\", VALUE(Lifetable!A21))","v":""},{"$f":"EXP(r_est*(A21-1))/Lifetable!F21","v":{"$error":"#VALUE!"}},{"$f":"EXP(-r_est*A21)*Lifetable!H21","v":{"$error":"#VALUE!"}},{"$error":"#VALUE!"},{"$error":"#VALUE!"},null,{"$f":"EXP(-r_est)*Lifetable!G21","v":0},{"$f":"Lifetable!E21*EXP(-r_est)*E22","v":{"$error":"#VALUE!"}},{"$error":"#VALUE!"}]
[{"$f":"IF(Lifetable!A22 = \"\", \"\", VALUE(Lifetable!A22))","v":""},{"$f":"EXP(r_est*(A22-1))/Lifetable!F22","v":{"$error":"#VALUE!"}},{"$f":"EXP(-r_est*A22)*Lifetable!H22","v":{"$error":"#VALUE!"}},{"$error":"#VALUE!"},{"$error":"#VALUE!"},null,{"$f":"EXP(-r_est)*Lifetable!G22","v":0},{"$f":"Lifetable!E22*EXP(-r_est)*E23","v":0},{"$error":"#DIV/0!"}]
[]
[]
["Adjust the data range of the graphs (if needed)!\n(Click on the graph and adjust the range of the X column)"]

{"sheet":"settings","index":4,"n_rows":25,"n_cols":30,"rows_kept":25,"cut":false,"hidden":false,"merged":[[24,10,26,22]]}
[null,null,null,null,"small bird",null,"large mammal",null,null,null,"Human","Morocco",null,null,null,"Niger",null,null,null,"Hungary",null,null,null,"Norway",null,null,null,"China"]
[null,null,null,"X","dx","mx","X","dx","mx",null,"X","dx","mx","N2010",null,"dx","mx","N2010",null,"dx","mx","N2010",null,"dx","mx","N2010",null,"dx","mx","N2010"]
[null,null,null,0,0.6,0,0,0.6,0,null,0,5.9321961045279105E-3,0,3178.7890000000002,null,2.263786493231747E-2,0,3401.3910000000001,null,1.073549214537717E-3,0,482.50900000000001,null,5.374933888313174E-4,0,306.01900000000001,null,2.3860584500966244E-3,0,82581.426000000007]
[null,null,null,1,0.6,1.57,1,0.1,0,null,5,3.2355513757025185E-4,0,3043.8130000000001,null,2.4094622158781767E-3,0,2675.4250000000002,null,0,0,482.63799999999998,null,0,0,297.572,null,2.0459879015279417E-4,0,78976.240000000005]
[null,null,null,2,0.6,1.825,2,0.01,0,null,10,2.7768560158502936E-4,0,3013.0250000000001,null,1.4716709646466792E-3,0,2129.9520000000002,null,0,0,510.16199999999998,null,0,0,315.51900000000001,null,2.424318908789015E-4,0,81134.357000000004]
[null,null,null,3,0.6,1.35,3,0.01,0,null,15,3.7994397346167335E-4,3.4000000000000002E-2,3185.9679999999998,null,2.0080235143204476E-3,0.20200000000000001,1619.595,null,2.9161235386575919E-4,2.0300000000000002E-2,624.83199999999999,null,0,6.0000000000000001E-3,325.24900000000002,null,3.0562631314081951E-4,6.9000000000000008E-3,101853.048]
[null,null,null,null,null,null,4,0.01,0,null,20,5.4317839097307039E-4,0.1004,3022.9549999999999,null,2.9017622886005714E-3,0.32300000000000001,1231.576,null,2.67985081806466E-4,4.1599999999999998E-2,605.45899999999995,null,5.00515781512849E-4,5.0200000000000002E-2,309.14699999999999,null,4.2360009297852603E-4,0.1255,130442.93]
[null,null,null,null,null,null,5,0.01,0.6,null,25,6.3012986575541484E-4,0.12509999999999999,2849.279,null,3.3990151132034592E-3,0.315,1031.9780000000001,null,5.4129498871805914E-4,7.5299999999999992E-2,642.18399999999997,null,5.0049999949950004E-4,0.1158,309.113,null,5.5707770046243101E-4,0.1178,102745.194]
[null,null,null,null,null,null,6,0.01,0,null,30,6.9980003532081636E-4,0.1198,2418.8249999999998,null,3.7712477670356266E-3,0.27800000000000002,901.03300000000002,null,6.8162175082271746E-4,8.1099999999999992E-2,818.42399999999998,null,5.0668802863395386E-4,0.12229999999999999,315.90499999999997,null,7.3192344569394257E-4,4.8000000000000001E-2,96707.758000000002]
[null,null,null,null,null,null,7,0.01,0.875,null,35,8.8950970077041936E-4,8.5900000000000004E-2,2128.547,null,4.1100954836832291E-3,0.21299999999999999,734.83399999999995,null,1.0236154219537257E-3,3.9700000000000006E-2,786.68899999999996,null,4.7874790188731994E-4,5.8000000000000003E-2,359.65100000000001,null,9.3484032782781843E-4,1.5099999999999999E-2,119589.716]
[null,null,null,null,null,null,8,0.01,0,null,40,1.2323799450374977E-3,4.1299999999999996E-2,1964.7049999999999,null,5.033603075732823E-3,9.8000000000000004E-2,618.149,null,1.8279952444703715E-3,8.0000000000000002E-3,674.43799999999999,null,8.8982062995741332E-4,1.0800000000000001E-2,369.96499999999997,null,1.2678007978364433E-3,5.7000000000000002E-3,125626.361]
[null,null,null,null,null,null,9,0.01,0.95,null,45,1.7420529937746865E-3,1.35E-2,1877.903,null,6.4353089172117092E-3,4.7E-2,592.82799999999997,null,3.7617409982209655E-3,2.9999999999999997E-4,597.322,null,1.3999210444530928E-3,5.9999999999999995E-4,336.51100000000002,null,1.9069071015322691E-3,1E-3,103768.205]
[null,null,null,null,null,null,10,0.3,0,null,50,2.6459341347615829E-3,0,1652.63,null,9.2606903493387873E-3,0,468.69099999999997,null,6.782842851183646E-3,0,716.92,null,2.5353195364624585E-3,0,320.60399999999998,null,3.1499413218400189E-3,0,82024.561000000002]
[null,null,null,null,null,null,11,0.6,0.75,null,55,4.1116467419311225E-3,0,1277.3499999999999,null,1.3216753044543015E-2,0,348.18,null,1.0246910445121334E-2,0,792.06600000000003,null,3.8312540570243853E-3,0,294.55900000000003,null,5.4710750681494363E-3,0,83184.948999999993]
[null,null,null,null,null,null,null,null,null,null,60,7.101213597403796E-3,0,805.88800000000003,null,1.902294686199198E-2,0,266.315,null,1.4142544943519141E-2,0,596.63900000000001,null,6.2328101927978177E-3,0,298.68700000000001,null,9.7879072133940509E-3,0,56897.485000000001]
[null,null,null,null,null,null,null,null,null,null,65,1.3963945093767893E-2,0,707.31799999999998,null,2.9294841495113702E-2,0,190.79,null,1.9496741167656633E-2,0,514.69200000000001,null,9.1959459015639681E-3,0,216.68100000000001,null,1.8851812139719037E-2,0,40421.925000000003]
[null,null,null,null,null,null,null,null,null,null,70,2.5785370258715044E-2,0,582.52700000000004,null,4.9807494035552589E-2,0,117.587,null,2.7793827734638628E-2,0,404.51,null,1.6001039126305613E-2,0,158.34100000000001,null,3.4053373386093586E-2,0,32500.542000000001]
[null,null,null,null,null,null,null,null,null,null,75,5.0448840639429435E-2,0,401.07299999999998,null,8.461370318923149E-2,0,63.567999999999998,null,4.4285269226114921E-2,0,322.54399999999998,null,2.8619245820656874E-2,0,131.93799999999999,null,5.5710187741861282E-2,0,22523.131000000001]
[null,null,null,null,null,null,null,null,null,null,80,0.10246737250654013,0,222.75700000000001,null,0.13950659308158903,0,26.081,null,7.3742262946081855E-2,0,196.55500000000001,null,5.2255208102407531E-2,0,107.16500000000001,null,8.6582533877614998E-2,0,11956.529]
[null,null,null,null,null,null,null,null,null,null,85,0.18650542971452638,0,65.938999999999993,null,0.22045413551916945,0,6.649,null,0.12124578635646543,0,126.837,null,9.3182665296957248E-2,0,76.302000000000007,null,0.1325363106528708,0,4964.66]
[null,null,null,null,null,null,null,null,null,null,90,0.33205022567117187,0,9.4779999999999998,null,0.38610038610038611,0,0.89,null,0.18408762570983789,0,24.581,null,0.16017240375094646,0,29.937000000000001,null,0.18856684869640855,0,1554.5909999999999]
[null,null,null,null,null,null,null,null,null,null,95,0.51216389244558258,0,0.80700000000000005,null,0.56000000000000005,0,6.3E-2,null,0.35760811259546854,0,7.2709999999999999,null,0.3097893432465923,0,6.3780000000000001,null,0.26988845471426692,0,272.32299999999998]
[]
[]
[null,null,null,null,null,null,null,null,null,null,"Human population data downloaded from: https://esa.un.org/unpd/wpp/DataQuery/ \nNote that age-specific fertility data were not available below the age of 15 and above 49. "]